{"text_format":"1","workbook":"xlsx","n_sheets":21,"sheets":["Hauptseite - main page","Bestellhilfe - ordering guide","Bilder","SI_Programming_Gateways","SI_Zylinder","SmartHandle Cover - order tool","SmartHandle Cover - overview","Zusammenfassung - summary","Comments","CommentsZyl","Bilder_SI_Zylinder","Bilder SH-Cover für Anzeige","Bilder SH-Cover sortiert","Langtext_Cover_Übers.","Bilder für Rückwärtssuche","Tabelle1","Hilfstabelle für Zus.fass.","ID medium","Tabelle2","OF-No.","Tabelle3"],"not_rendered":{"charts":0,"images":117,"macros":1,"external_links":3,"defined_names":176,"comments":5,"pivot_tables":0},"unopened":[],"bounds":{"document_bytes":16777216,"sheet_cells":100000,"rows_first":2000,"rows_last":500,"rows_between":2000,"halvings":0,"cell_chars":16384,"cell_head_chars":4096},"cells_cut":0,"cells_raw":0,"read":"whole","date_system":"1900"}

{"sheet":"Hauptseite - main page","index":0,"n_rows":236,"n_cols":11,"rows_kept":236,"cut":false,"hidden":true,"merged":[[23,4,23,5],[23,6,23,8],[23,9,23,11],[35,8,38,10],[1,5,1,8],[2,6,2,7],[3,5,3,8],[8,8,13,13],[7,2,7,6],[8,2,8,6],[10,2,10,6],[11,2,11,6],[13,2,13,6],[44,1,44,13],[181,0,181,1],[181,4,181,5],[181,7,181,8],[182,4,182,5],[182,7,182,8],[177,0,177,1],[176,0,176,1],[177,4,177,5],[176,4,176,5],[176,7,176,8],[177,7,177,8],[55,0,55,13],[59,0,59,13]]}
[]
["SmartIntego -",null,null,null,null,"Sprache / language / langue / lingua / taal / sprog"]
[{"$f":"HLOOKUP(G3,A207:F227,13,0)","v":"noch zu übersetzen"},null,null,null,null,null,"Dansk"]
[null,null,null,null,null,{"$f":"SI_Programming_Gateways!J190","v":"*** Aktiver venligst makroer ***"}]
[]
[]
[]
[{"$f":"SI_Programming_Gateways!A13","v":"Kundenummer"},null,123456,null,null,null,null,null,{"$f":"SI_Programming_Gateways!L15","v":"noch zu übersetzen"}]
[{"$f":"SI_Programming_Gateways!A15","v":"Kundenavn"},null,"Test customer",null,null,null,null,null,"to the office address"]
[]
[{"$f":"SI_Programming_Gateways!E13","v":"Projektnummer"},null,"Test project"]
[{"$f":"SI_Programming_Gateways!E15","v":"Projektnavn"},null,"19-Test"]
[]
[{"$f":"SI_Programming_Gateways!L13","v":"Tillæg til ordrenummer"},null,987654321]
[]
[]
[]
[]
[]
[{"$f":"HLOOKUP(G3,A207:F227,2,0)","v":"noch zu übersetzen"}]
[]
[]
[]
[null,{"$f":"HLOOKUP(G3,A207:F227,3,0)","v":"Smarthandle"},null,null,{"$f":"HLOOKUP(G3,A207:F227,4,0)","v":"noch zu übersetzen"},null,{"$f":"HLOOKUP(G3,A207:F227,5,0)","v":"noch zu übersetzen"},null,null,{"$f":"K220","v":"noch zu übersetzen"}]
[]
[]
[]
[]
[]
[]
[]
[]
[]
[]
[]
[null,null,null,null,null,null,null,null,{"$f":"HLOOKUP(G3,A207:F227,12,0)","v":"noch zu übersetzen"}]
[]
[]
[]
[]
[]
[]
[]
[]
[null,{"$f":"K234","v":"noch zu übersetzen"}]
[]
[]
[]
[]
[]
[]
[]
[]
[]
[]
[{"$f":"HLOOKUP(G3,A207:F227,7,0)","v":"noch zu übersetzen"}]
[]
[]
[]
[{"$f":"HLOOKUP(G3,A207:F227,10,0)","v":"SmartIntego Website"}]
[]
[]
[]
[]
[]
[]
[]
[]
[]
[]
[]
[]
[]
[]
[]
[]
[]
[]
[]
[]
[]
[]
[]
[]
[]
[]
[]
[]
[]
[]
[]
[]
[]
[]
[]
[]
[]
[]
[]
[]
[]
[]
[]
[]
[]
[]
[]
[]
[]
[]
[]
[]
[]
[]
[]
[]
[]
[]
[]
[]
[]
[]
[]
[]
[]
[]
[]
[]
[]
[]
[]
[]
[]
[]
[]
[]
[]
[]
[]
[]
[]
[]
[]
[]
[]
[]
[]
[]
[]
[]
[]
[]
[]
[]
[]
[]
[]
[]
[]
[]
[]
[]
[]
[]
[]
[]
[]
[]
[]
[]
[]
[]
[]
[]
[]
[]
["lange Artikelnummer",null,null,null,"OF-Nummer",null,null,"Artikelkategorie"]
[null,null,null,null,{"$f":"IFERROR(IF(A178=\"\",\"\",VLOOKUP(A178,'OF-No.'!$A$2:$C$1600,2,FALSE)),K236)","v":""},null,null,{"$f":"IFERROR(IF(A178=\"\",\"\",VLOOKUP(A178,'OF-No.'!$A$2:$C$1600,3,FALSE)),K229)","v":""}]
[]
[]
["Rückwärtssuche"]
["lange Artikelnummer",null,null,null,"OF-Nummer",null,null,"Artikelkategorie"]
[{"$f":"IFERROR(IF(E183=\"\",\"\",INDEX('OF-No.'!$A$2:$A$1600,MATCH('Hauptseite - main page'!E183,'OF-No.'!$B$2:$B$1600,0))),K224)","v":"SI.GN2.ER"},null,null,null,"OF9935",null,null,{"$f":"IFERROR(IF(E183=\"\",\"\",VLOOKUP(A183,'OF-No.'!$A$2:$C$1600,3,FALSE)),K229)","v":"noch zu übersetzen"}]
[]
[]
[]
[]
[]
[]
[]
[]
[]
[]
[]
[]
[]
[]
[]
[]
[]
[]
[]
[]
[]
[]
[]
["Deutsch","English","Français","Italiano","Nederlands","Dansk","Svenska",1]
["Was möchten Sie bestellen?","What would you like to order?","Que souhaitez-vous commander ?","Cosa desideri ordinare?","noch zu übersetzen","noch zu übersetzen",null,2]
["Smarthandle","Smarthandle","Smarthandle","Smarthandle","Smarthandle","Smarthandle",null,3]
["Zylinder","cylinder","cylindre","cilindri","noch zu übersetzen","noch zu übersetzen",null,4]
["Programmierequipment & GatewayNodes","programming equipment & GatewayNodes","Outils de programmation & nœuds de passerelle","dispositivi di programmazione e GatewayNodes","noch zu übersetzen","noch zu übersetzen",null,5]
["SmartHandle Cover","SmartHandle Cover","noch zu übersetzen","noch zu übersetzen","noch zu übersetzen","noch zu übersetzen",null,6]
["Benötigen Sie zusätzliche Informationen?","Do you require further information?","Souhaitez-vous plus d'informations ?","Necessiti di ulteriori informazioni ?","noch zu übersetzen","noch zu übersetzen",null,7]
["Gesamtaufstellung aller verfügbaren SmartHandle Cover","overview of all available SmartHandle covers","liste de toutes les plaques disponibles pour Smart Handles","elenco di tutte le possibili cover per la SmartHandle","Overzicht alle beschikbare Smarthandle schilden","Oversigt over dækkappe til Smart Handle",null,8]
["https://www.smartintego.com/de/home/home/","https://www.smartintego.com/int/home/home/","https://www.smartintego.com/fr/home/home/","https://www.smartintego.com/int/home/home/","https://www.smartintego.com/int/home/home/","https://www.smartintego.com/int/home/home/",null,null,null,null,{"$f":"HLOOKUP($G$3,A207:F215,9,0)","v":"https://www.smartintego.com/int/home/home/"}]
["SmartIntego Website","SmartIntego Website","SmartIntego Website","SmartIntego Website","SmartIntego Website","SmartIntego Website",null,10,"SmartIntego Website"]
["Welches SmartHandle Cover muss ich bestellen? ","Which SmartHandle Cover do I need to order?","noch zu übersetzen","noch zu übersetzen","noch zu übersetzen","noch zu übersetzen",null,11]
["Zur Anzeige der kompletten Bestellung, bitte auf den Pfeil klicken","To show the complete order, please click the arrow","Pour visualiser la commande complète, veuillez cliquer sur la flèche","Per visualizzare l'ordine completo clicca sulla freccia","noch zu übersetzen","noch zu übersetzen",null,12]
["Bestell-Leitfaden","order guideline","Guide de commande","Guida all'ordine","noch zu übersetzen","noch zu übersetzen",null,13]
["Identifikations-Medien","ID medium","Outils d'identification","Supporti di identificazione","noch zu übersetzen","noch zu übersetzen",null,14,null,null,{"$f":"HLOOKUP($G$3,$A$207:$F$220,14,0)","v":"noch zu übersetzen"}]
["zur Zusammenfassung","go to summary","Accéder au résumé","vai al riepilogo","naar de samenvatting","til resumé","till sammanfattningen",14,null,null,{"$f":"HLOOKUP($G$3,$A$207:$F$221,15,0)","v":"til resumé"}]
["keine Auswahl getroffen","no selection made","Aucune sélection","nessuna scelta effettuata","geen selectie gemaakt","Intet valgt","inget val gjort",null,null,null,{"$f":"HLOOKUP($G$3,$A$207:$F$222,16,0)","v":"Intet valgt"}]
["bitte Standard Bestellcode angeben (z.B. SI.GN2.ER)","please enter standard order code (e.g. SI.GN2.ER)","Sairir le code de commande standard (par ex. SI.GN2.ER)","inserisci il codice standard del prodotto ( ad es. SI.GN2.ER)","noch zu übersetzen","noch zu übersetzen",null,null,null,null,{"$f":"HLOOKUP($G$3,$A$207:$F$223,17,0)","v":"noch zu übersetzen"}]
["Bestellcode wird nach Prüfung nachgereicht","short order code will be submitted after verification","Le code de commande sera soumis après vérification","il codice prodotto seguirà dopo verifica","noch zu übersetzen","noch zu übersetzen","noch zu übersetzen",null,null,null,{"$f":"HLOOKUP($G$3,$A$207:$F$224,18,0)","v":"noch zu übersetzen"}]
["OF-Nummer und Artikelkategorie anzeigen","show OF-No. & item category","Visualiser le numéro OF et la catégorie d'articles","visualizzare il codice OF e la categoria prodotto","noch zu übersetzen","noch zu übersetzen","noch zu übersetzen",null,null,null,{"$f":"HLOOKUP($G$3,$A$207:$F$225,19,0)","v":"noch zu übersetzen"}]
["Artikelkategorie","item category","Catégories d'articles","categoria prodotto","noch zu übersetzen","noch zu übersetzen","noch zu übersetzen",null,null,null,{"$f":"HLOOKUP($G$3,$A$207:$F$226,20,0)","v":"noch zu übersetzen"}]
["Programmierequipment","programming equipment","Outils de programmation","dispositivo di programmazione","noch zu übersetzen","noch zu übersetzen","noch zu übersetzen",null,null,null,{"$f":"HLOOKUP($G$3,$A$207:$F$228,21,0)","v":"noch zu übersetzen"}]
["GatewayNodes","GatewayNodes","Nœuds de passerelle","GatewayNodes","noch zu übersetzen","noch zu übersetzen","noch zu übersetzen",null,null,null,{"$f":"HLOOKUP($G$3,$A$207:$F$228,22,0)","v":"noch zu übersetzen"}]
["Artikelkategorie wird nach Prüfung nachgereicht","item category will be submitted after verification","La catégorie d'articles sera soumise après vérification","la categoria prodotto seguirà dopo verifica","noch zu übersetzen","noch zu übersetzen","noch zu übersetzen",null,null,null,{"$f":"HLOOKUP($G$3,$A$207:$F$229,23,0)","v":"noch zu übersetzen"}]
["neue Suche","new selection","nouvelle recherche","seleziona di nuovo","noch zu übersetzen","noch zu übersetzen","noch zu übersetzen",null,null,null,{"$f":"HLOOKUP($G$3,$A$207:$F$230,24,0)","v":"noch zu übersetzen"}]
["bitte OF-Nummer angeben (z.B. OF9935)","please enter short order code (e.g. OF9935)","saisir le code OF (par ex.PF9935)","inserisci il codice OF (ad es. OF9935)","noch zu übersetzen","noch zu übersetzen","noch zu übersetzen",null,null,null,{"$f":"HLOOKUP($G$3,$A$207:$F$232,25,0)","v":"noch zu übersetzen"}]
["Standard Bestellnummer","standard order code","Code de commande standard","codice standard del prodotto","noch zu übersetzen","noch zu übersetzen","noch zu übersetzen",null,null,null,{"$f":"HLOOKUP($G$3,$A$207:$F$232,26,0)","v":"noch zu übersetzen"}]
["Standard Bestellcode und Artikelkategorie anzeigen","show standard order code & item category","Visualiser le code de commande standard et la catégorie d'articles","visualizzare il codice standard e la categoria del prodotto","noch zu übersetzen","noch zu übersetzen","noch zu übersetzen",null,null,null,{"$f":"HLOOKUP($G$3,$A$207:$F$233,27,0)","v":"noch zu übersetzen"}]
["Umwandlung Standard Bestellcode <--> kurzer Bestellcode (OF-Nummer)","conversion standard order code <--> short order code (OF-No.)","Conversion du code de commande standard <--> code de commande abrégé (Nr. OF)","conversione codice standard del prodotto <--> codice breve del prodotto (codice OF)","noch zu übersetzen","noch zu übersetzen","noch zu übersetzen",null,null,null,{"$f":"HLOOKUP($G$3,$A$207:$F$234,28,0)","v":"noch zu übersetzen"}]
["schließen","close","fermer","chiudi","noch zu übersetzen","noch zu übersetzen","noch zu übersetzen",null,null,null,{"$f":"HLOOKUP($G$3,$A$207:$F$235,29,0)","v":"noch zu übersetzen"}]
["OF-Nummer wird nach Prüfung nachgereicht","short order code (OF-No.) will be submitted after verification","Le numéro OF sera soumis après vérification","il codice breve del prodotto (codice OF) seguirà dopo verifica","noch zu übersetzen","noch zu übersetzen","noch zu übersetzen",null,null,null,{"$f":"HLOOKUP($G$3,$A$207:$F$236,30,0)","v":"noch zu übersetzen"}]

{"sheet":"Bestellhilfe - ordering guide","index":1,"n_rows":733,"n_cols":143,"rows_kept":733,"cut":false,"hidden":false,"merged":[[110,7,110,8],[132,7,132,8],[13,1,13,2],[13,4,13,5],[13,6,13,9],[26,0,26,10],[27,0,27,10],[28,0,28,10],[7,13,7,14],[8,3,8,5],[8,13,8,14],[11,4,11,5],[11,6,11,7],[11,11,11,13],[6,13,6,14],[1,7,1,10],[2,0,2,6],[3,7,3,10],[5,5,5,6],[5,7,5,10]]}
[" "]
[]
[{"$f":"HLOOKUP($I$3,A234:G302,2,0)","v":"Hjælp til bestilling af Digitalt SmartHandle - AX"},null,null,null,null,null,null,null,{"$f":"'Hauptseite - main page'!G3","v":"Dansk"}]
[]
[null,null,null,null,null,null,null,null,null,null,null,null,null,null,null,null,"Stand: 10 / 2019"]
[null,null,{"$f":"HLOOKUP($I$3,A234:G302,47,0)","v":"for at se SmartHandle vælges de med gult markerede felter i drop-down menuen"},null,{"$f":"J351","v":"Yderside"},{"$f":"J352","v":"Inderside"},null,{"$f":"HLOOKUP($I$3,$A$234:$G$310,4,0)","v":"Vælg håndtagsvarianter"},null,null,null,null,null,null,{"$f":"I360","v":"Dimensioneringer"},"Cover"]
[null,{"$f":"HLOOKUP($I$3,A234:G302,12,0)","v":"Profil"},"(E1) - Skandinavisk Oval\n- med låsecylinderåbning  / stående montage",null,null,null,null,null,"A."]
[null,{"$f":"F16","v":"Udvendig roset"},"uden roset (0)"]
[null,{"$f":"G16","v":"Indvendig roset"},"uden låsecylinder-åbning (1)"," ",null,null,null,null,null,null,null,null,null,null,null,null,null,null,null,"Druckverbot \"T10\""]
[null,null,null,null,null,null,null,null,null,null,null,null,null,null,null,null,null,null,null,0]
[]
[{"$f":"HLOOKUP($I$3,A234:G302,5,0)","v":"Kundenummer"},4711,null,null,{"$f":"HLOOKUP($I$3,A234:G302,6,0)","v":"Kundenavn"},null,"Ich AG",null,null,null,null,{"$f":"HLOOKUP($I$3,A234:G302,7,0)","v":"Projekt-nr.  "},null,null,"17-15145"]
[]
[{"$f":"HLOOKUP($I$3,A234:G302,8,0)","v":"Projekt-navn  "},"Kölnisch Wasser",null,null,{"$f":"HLOOKUP($I$3,A234:G302,9,0)","v":"Bilag til bestilling  "},null,"Testbestellung Kerstin Horvat"]
[]
[{"$f":"HLOOKUP(I3,A234:G302,10,0)","v":"Antal"},{"$f":"HLOOKUP($I$3,A234:G334,11,0)","v":"Produktnavn"},"Panikstangenadaption (bei Bedarf bitte Button klicken)",{"$f":"I370","v":"Brandbeskyttelse / Flugtdøre / PAS24"},{"$f":"HLOOKUP($I$3,A234:G302,12,0)","v":"Profil"},{"$f":"I247","v":"Udvendig roset"},{"$f":"I291","v":"Indvendig roset"},{"$f":"HLOOKUP($I$3,A234:G302,19,0)","v":"Udvendigt håndtag"},{"$f":"HLOOKUP($I$3,A234:G302,20,0)","v":"Indvendigt håndtag"},{"$f":"HLOOKUP($I$3,A234:G302,21,0)","v":"Overflade"},{"$f":"HLOOKUP($I$3,A234:G302,15,0)","v":"Dørtykkelse (mm)"},{"$f":"HLOOKUP($I$3,A234:G302,16,0)","v":"Firkant (mm)"},{"$f":"HLOOKUP($I$3,A234:G302,22,0)","v":"Læseteknik"},"Optionen",{"$f":"HLOOKUP($I$3,A234:G302,24,0)","v":"Kompl. varenummer"},{"$f":"HLOOKUP($I$3,A234:G302,25,0)","v":"Korrekt varenummer?"},{"$f":"I284","v":"Bemærkninger"},null,"Wenn FSB-Drücker, dann Adapter","Produktname","Profil / Montage",null,"Außen-rosette","Innen-rosette",null,"Drücker außen","Drücker innen",null,"Ober-fläche",null,"Tür-dicke",null,"Vierkant",null,"Lese-technik",null,"G2","Optionen","Panik","Brandschutz",null,"Langtext",null,null,null,"wenn Panikstangen",null,null,"wenn Bemerkung gefüllt",null,null,null,"wenn FH"]
[1,"Smart Intego\n(SI-S2)",{"$f":"IF(B186<>\"\",B186,\"\")","v":""},"kræves ikke","(E1) - Skandinavisk Oval\n- med låsecylinderåbning  / stående montage","uden roset (0)","uden låsecylinder-åbning (1)","L-form rund (A )","L-form rund (A )","sølv / sort grå (1)","59-80 mm (M)","08","(M) SmartCards / SmartTags","(WO) Wireless Online",{"$f":"IF(P17=$B$279,T17&U17&V17&W17&X17&Y17&Z17&AA17&AB17&AC17&AD17&AE17&AF17&AG17&AH17&AI17&AJ17&AK17&VLOOKUP(D17,$A$148:$D$151,4,FALSE)&AL17&AM17,\"\")","v":"SI-S2.E1.01.AA.1.M08.M.WO"},{"$f":"IF(AND(A17<>\"\",B17<>\"\",E17<>\"\",F17<>\"\",G17<>\"\",H17<>\"\",I17<>\"\",J17<>\"\",K17<>\"\",L17<>\"\",M17<>\"\",N17<>\"\"),$B$279,$A$279)","v":"P"},{"$f":"IF(S17=1,$I$259,IF(AT17=1,$I$318,IF(D17=$I$382,$I$384,\"\")))","v":""},{"$f":"IF(AND(P17=$A$279,B17<>\"\"),1,0)","v":0},{"$f":"IF(H17=$I$308,1,0)","v":0},{"$f":"IF(B17<>\"\",VLOOKUP(B17,$B$34:$D$35,3,FALSE),\"\")","v":"SI-S2."},{"$f":"IF(E17<>\"\",VLOOKUP(E17,$A$44:$B$53,2,FALSE),\"\")","v":"E1"},{"$f":"IF(U17<>\"\",\".\",\"\")","v":"."},{"$f":"IF(F17<>\"\",VLOOKUP(F17,$H$97:$I$99,2,FALSE),\"\")","v":0},1,{"$f":"IF(X17<>\"\",\".\",\"\")","v":"."},{"$f":"IF(H17<>\"\",VLOOKUP(H17,$H$85:$I$90,2,FALSE),\"\")","v":"A"},{"$f":"IF(I17<>\"\",VLOOKUP(I17,$H$85:$I$91,2,FALSE),\"\")","v":"A"},{"$f":"IF(AA17<>\"\",\".\",\"\")","v":"."},{"$f":"IF(J17<>\"\",VLOOKUP(J17,$A$97:$B$99,2,FALSE),\"\")","v":1},{"$f":"IF(AC17<>\"\",\".\",\"\")","v":"."},{"$f":"IF(K17<>\"\",VLOOKUP(K17,$A$85:$B$92,2,FALSE),\"\")","v":"M"},null,{"$f":"IF(L17<>\"\",L17,\"\")","v":"08"},{"$f":"IF(AG17<>\"\",\".\",\"\")","v":"."},{"$f":"IF(M17<>\"\",VLOOKUP(M17,$K$85:$L$86,2,FALSE),\"\")","v":"M"},{"$f":"IF(AK17<>\"\",\".\",\"\")","v":""},null,{"$f":"IF(AND($N17<>\"\",$N17<>$J$340,$N17<>$J$341),VLOOKUP(N17,$K$60:$L$64,2,FALSE),\"\")","v":".WO"},{"$f":"IF(C17<>\"\",\".P\"&VLOOKUP(C17,B186:C186,2,FALSE),\"\")","v":""},{"$f":"IF(D17<>$A$148,\", \"&D17,\"\")","v":""},null,{"$f":"IF(P17=$B$279,(VLOOKUP(B17,$B$34:$C$35,2,FALSE)&VLOOKUP(U17,$N$157:$O$184,2,FALSE)&AN17&\", \"&J17&\", \"&M17&IF(AL17<>\"\",VLOOKUP(AL17,$L$60:$M$66,2,FALSE),\"\")),\"\")","v":"SmartHandle AX (Smart Intego), (E0) - Skandinavisk Oval\n- uden låsecylinderåbning / stående montage, sølv / sort grå (1), (M) SmartCards / SmartTagsWireless Online"},null,null,null,{"$f":"IF(OR(C17=$I$375,C17=$I$376),1,0)","v":0},null,null,{"$f":"IF(Q17<>\"\",1,\"\")","v":""},null,null,null,{"$f":"IF(OR(D17=$C$199,D17=$C$201)*AND(E17<>$A$179),1,0)","v":0}]
[null,null,{"$f":"IF(B187<>\"\",B187,\"\")","v":""},null,null,null,null,null,null,null,null,"",null,null,{"$f":"IF(P18=$B$279,T18&U18&V18&W18&X18&Y18&Z18&AA18&AB18&AC18&AD18&AE18&AF18&AG18&AH18&AI18&AJ18&AK18&VLOOKUP(D18,$A$148:$D$151,4,FALSE)&AL18&AM18,\"\")","v":""},{"$f":"IF(AND(A18<>\"\",B18<>\"\",E18<>\"\",F18<>\"\",G18<>\"\",H18<>\"\",I18<>\"\",J18<>\"\",K18<>\"\",L18<>\"\",M18<>\"\",N18<>\"\"),$B$279,$A$279)","v":"Î"},{"$f":"IF(S18=1,$I$259,IF(AT18=1,$I$318,IF(D18=$I$382,$I$384,\"\")))","v":""},{"$f":"IF(AND(P18=$A$279,B18<>\"\"),1,0)","v":0},0,"",{"$f":"IF(E18<>\"\",VLOOKUP(E18,$A$44:$B$53,2,FALSE),\"\")","v":""},"","","",{"$f":"IF(X18<>\"\",\".\",\"\")","v":""},"",{"$f":"IF(I18<>\"\",VLOOKUP(I18,$H$85:$I$91,2,FALSE),\"\")","v":""},{"$f":"IF(AA18<>\"\",\".\",\"\")","v":""},"",{"$f":"IF(AC18<>\"\",\".\",\"\")","v":""},"",null,"",{"$f":"IF(AG18<>\"\",\".\",\"\")","v":""},"",{"$f":"IF(AK18<>\"\",\".\",\"\")","v":""},null,{"$f":"IF(AND($N18<>\"\",$N18<>$J$340,$N18<>$J$341),VLOOKUP(N18,$K$60:$L$64,2,FALSE),\"\")","v":""},{"$f":"IF(C18<>\"\",\".P\"&VLOOKUP(C18,B187:C187,2,FALSE),\"\")","v":""},{"$f":"IF(D18<>$A$148,\", \"&D18,\"\")","v":", "},null,{"$f":"IF(P18=$B$279,(VLOOKUP(B18,$B$34:$C$35,2,FALSE)&VLOOKUP(U18,$N$157:$O$184,2,FALSE)&AN18&\", \"&J18&\", \"&M18&IF(AL18<>\"\",VLOOKUP(AL18,$L$60:$M$66,2,FALSE),\"\")),\"\")","v":""},null,null,null,{"$f":"IF(OR(C18=$I$375,C18=$I$376),1,0)","v":0},null,null,{"$f":"IF(Q18<>\"\",1,\"\")","v":""},null,null,null,{"$f":"IF(OR(D18=$C$199,D18=$C$201)*AND(E18<>$A$179),1,0)","v":0}]
[null,null,"",null,null,null,null,null,null,null,null,"",null,null,{"$f":"IF(P19=$B$279,T19&U19&V19&W19&X19&Y19&Z19&AA19&AB19&AC19&AD19&AE19&AF19&AG19&AH19&AI19&AJ19&AK19&VLOOKUP(D19,$A$148:$D$151,4,FALSE)&AL19&AM19,\"\")","v":""},"Î","",0,0,"","","","","","","","","","","","",null,"","","","",null,"","",", ",null,{"$f":"IF(P19=$B$279,(VLOOKUP(B19,$B$34:$C$35,2,FALSE)&VLOOKUP(U19,$N$157:$O$184,2,FALSE)&AN19&\", \"&J19&\", \"&M19&IF(AL19<>\"\",VLOOKUP(AL19,$L$60:$M$66,2,FALSE),\"\")),\"\")","v":""},null,null,null,0,null,null,"",null,null,null,0]
[null,null,"",null,null,null,null,null,null,null,null,null,null,null,"","Î","",0,0,"","","","","","","","","","","","",null,"","","","",null,"","",", ",null,"",null,null,null,0,null,null,"",null,null,null,0]
[null,null,"",null,null,null,null,null,null,null,null,"",null,null,"","Î","",0,0,"","","","","","","","","","","","",null,"","","","",null,"","",", ",null,"",null,null,null,0,null,null,"",null,null,null,0]
[null,null,"",null,null,null,null,null,null,null,null,"",null,null,"","Î","",0,0,"","","","","","","","","","","","",null,"","","","",null,"","",", ",null,"",null,null,null,0,null,null,"",null,null,null,0]
[null,null,"",null,null,null,null,null,null,null,null,"",null,null,"","Î","",0,0,"","","",{"$f":"IF(F23<>\"\",VLOOKUP(F23,$H$97:$I$99,2,FALSE),\"\")","v":""},{"$f":"IF(G23<>\"\",VLOOKUP(G23,$H$97:$I$99,2,FALSE),\"\")","v":""},"","","","","","","",null,"","","","",null,"","",", ",null,"",null,null,null,0,null,null,"",null,null,null,0]
[null,null,"",null,null,null,null,null,null,null,null,"",null,null,"","Î","",0,0,"","","","","","","","","","","","",null,"","","","",null,"","",", ",null,"",null,null,null,0,null,null,"",null,null,null,0]
[null,null,null,null,null,null,null,null,null,null,null,null,null,null,{"$f":"IF(A25<>\"\",F34,\"\")","v":""},null,{"$f":"IF(A25=\"\",\"\",\"\")","v":""},null,null,null,null,"","","","","","","","","","",null,"","","",{"$f":"IF(AI25<>\"\",\".\",\"\")","v":""},{"$f":"IF(M25<>\"\",\"G2\",\"\")","v":""},{"$f":"IF(AND($O25<>\"\",$O25<>$J$340,$O25<>$J$341),$O25,\"\")","v":""},{"$f":"IF(C27<>\"\",\".P\"&VLOOKUP(C27,B195:C195,2,FALSE),\"\")","v":""},{"$f":"IF(D27<>A157,\", \"&D27,\"\")","v":""},null,{"$f":"IF(AL25<>\"\",VLOOKUP(AL25,$F$34:$G$35,2,FALSE),\"\")","v":""},null,null,null,{"$f":"IF(OR(C194=1,C194=2),1,0)","v":0},null,null,""]
[null,null,null,null,null,null,null,null,null,null,null,null,null,{"$f":"IF(A27<>\"\",F35,\"\")","v":""},{"$f":"IF(A26<>\"\",F35,\"\")","v":""},null,{"$f":"IF(A26=\"\",\"\",\"\")","v":""},{"$f":"SUM(R17:R25)","v":0},{"$f":"SUM(S17:S24)","v":0},null,null,"",{"$f":"IF(F27<>\"\",VLOOKUP(F27,$H$97:$I$99,2,FALSE),\"\")","v":""},{"$f":"IF(G27<>\"\",VLOOKUP(G27,$H$97:$I$99,2,FALSE),\"\")","v":""},"",{"$f":"IF(H27<>\"\",VLOOKUP(H27,$H$85:$I$90,2,FALSE),\"\")","v":""},{"$f":"IF(I27<>\"\",VLOOKUP(I27,$H$85:$I$91,2,FALSE),\"\")","v":""},"",{"$f":"IF(J27<>\"\",VLOOKUP(J27,$A$97:$B$99,2,FALSE),\"\")","v":""},"",{"$f":"IF(K27<>\"\",VLOOKUP(K27,$A$85:$B$92,2,FALSE),\"\")","v":""},null,"","","","","",{"$f":"IF(AND($O26<>\"\",$O26<>$J$340,$O26<>$J$341),$O26,\"\")","v":""},{"$f":"IF(C28<>\"\",\".P\"&VLOOKUP(C28,B196:C196,2,FALSE),\"\")","v":""},{"$f":"IF(D28<>A158,\", \"&D28,\"\")","v":", "},null,{"$f":"IF(AL26<>\"\",VLOOKUP(AL26,$F$34:$G$35,2,FALSE),\"\")","v":""},null,null,null,{"$f":"SUM(AT17:AT24)","v":0},null,null,""]
[{"$f":"IF(S26>0,I361,\"\")","v":""},null,null,null,null,null,null,null,null,null,null,null,null,null,null,null,null,null,null,null,null,"",{"$f":"IF(F28<>\"\",VLOOKUP(F28,$H$97:$I$99,2,FALSE),\"\")","v":""},{"$f":"IF(G28<>\"\",VLOOKUP(G28,$H$97:$I$99,2,FALSE),\"\")","v":""},"",{"$f":"IF(H28<>\"\",VLOOKUP(H28,$H$85:$I$90,2,FALSE),\"\")","v":""},{"$f":"IF(I28<>\"\",VLOOKUP(I28,$H$85:$I$91,2,FALSE),\"\")","v":""},"",{"$f":"IF(J28<>\"\",VLOOKUP(J28,$A$97:$B$99,2,FALSE),\"\")","v":""},"",{"$f":"IF(K28<>\"\",VLOOKUP(K28,$A$85:$B$92,2,FALSE),\"\")","v":""},null,"","","","","",null,null,null,null,null,null,null,null,0,null,null,{"$f":"SUM(AW17:AW26)","v":0},null,null,null,{"$f":"SUM(BA17:BA26)","v":0}]
[{"$f":"IF(AT26>0,I381,\"\")","v":""}]
[{"$f":"IF(BA27>0,I383,\"\")","v":""}]
[]
[]
[]
["SmartHandle Version"]
["SmartHandle AX (S2)",{"$f":"HLOOKUP($I$3,$A$234:$G$358,113,FALSE)&CHAR(10)&\"(SI-S2)\"","v":"Smart Intego\n(SI-S2)"},{"$f":"HLOOKUP($I$3,$A$234:$G$358,111,FALSE)&\", \"","v":"SmartHandle AX (Smart Intego), "},"SI-S2.",null,"S2.Adapterset.FSB",{"$f":"I368","v":"Adaptersæt til montering af FSB greb"}]
[null,null,null,null,null,"S2.Adapterset.GLUTZ",{"$f":"I369","v":"Adaptersæt til montering af GLUTZ greb"}]
[]
[]
[]
[]
[]
["für Auswahl in Zeilen",null,null,null,null,null,null,null,null,null,null,null,null,null,null,null,null,null,null,null,null,null,null,null,null,null,null,null,null,null,null,null,null,null,null,null,null,null,null,null,null,null,null,null,null,null,null,null,null,null,null,null,null,null,null,null,null,null,null,null,null,null,null,null,null,null,null,null,null,null,null,null,null,null,null,null,null,null,null,null,null,null,null,null,null,null,null,null,null,null,null,null,null,null,null,null,null,null,null,null,null,null,null,null,null,null,null,null,null,null,null,null,null,null,null,null,null,null,null,null,null,null,null,null,null,null,null,null,null,null,null,null,null,null,null,null,null,null,null,null,null,"zur Anzeige der Beispiel-Zeichnungen"]
[]
["Profil","Produktcode","Außenrosette","Innenrosette","Außendrücker","Vierkant","für Türdicken",null,null,"für stehend / hängend",null,null,null,"Für Türdicken",null,null,"für MO / blind","für stehend / hängend",null,null,null,null,null,null,null,null,null,null,null,null,null,null,null,null,null,null,null,null,null,null,null,null,null,null,null,null,null,null,null,null,null,null,null,null,null,null,null,null,null,null,null,null,null,null,null,null,null,null,null,null,null,null,null,null,null,null,null,null,null,null,null,null,null,null,null,null,null,null,null,null,null,null,null,null,null,null,null,null,null,null,null,null,null,null,null,null,null,null,null,null,null,null,null,null,null,null,null,null,null,null,null,null,null,null,null,null,null,null,null,null,null,null,null,null,null,null,null,null,null,null,null,"Profil","für stehend/hängend"]
[{"$f":"$I$260","v":"(A0) - Europrofil\n- stående Montage"},"A0",1,1,1,1,1,null,null,1,2,null,null,1,2,null,1,1,2,3,null,null,null,null,null,null,null,null,null,null,null,null,null,null,null,null,null,null,null,null,null,null,null,null,null,null,null,null,null,null,null,null,null,null,null,null,null,null,null,null,null,null,null,null,null,null,null,null,null,null,null,null,null,null,null,null,null,null,null,null,null,null,null,null,null,null,null,null,null,null,null,null,null,null,null,null,null,null,null,null,null,null,null,null,null,null,null,null,null,null,null,null,null,null,null,null,null,null,null,null,null,null,null,null,null,null,null,null,null,null,null,null,null,null,null,null,null,null,null,null,null,{"$f":"IF($I$3=\"Deutsch\",$A260,IF($I$3=\"English\",$B260,IF($I$3=\"Français\",$C260,IF($I$3=\"Italiano\",$D260,IF($I$3=\"Nederlands\",$E260,\"\")))))","v":""},1]
[{"$f":"$I$299","v":"(A1) - Europrofil\n- hængende Montage [70-79 mm]"},"A1",2,3,1,1,1,null,null,{"$f":"HLOOKUP($I$3,$A$234:$G$348,65,FALSE)","v":"stående montage"},{"$f":"HLOOKUP($I$3,$A$234:$G$348,65,FALSE)","v":"stående montage"},null,null,"38-60 mm (S)","38-57 mm (S)",null,3,{"$f":"IF($I$3=\"Deutsch\",$A270,IF($I$3=\"English\",$B270,IF($I$3=\"Français\",$C270,IF($I$3=\"Italiano\",$D270,IF($I$3=\"Nederlands\",$E270,\"\")))))","v":""},{"$f":"IF($I$3=\"Deutsch\",$A270,IF($I$3=\"English\",$B270,IF($I$3=\"Français\",$C270,IF($I$3=\"Italiano\",$D270,IF($I$3=\"Nederlands\",$E270,\"\")))))","v":""},{"$f":"IF($I$3=\"Deutsch\",$A271,IF($I$3=\"English\",$B271,IF($I$3=\"Français\",$C271,IF($I$3=\"Italiano\",$D271,IF($I$3=\"Nederlands\",$E271,\"\")))))","v":""},null,null,null,null,null,null,null,null,null,null,null,null,null,null,null,null,null,null,null,null,null,null,null,null,null,null,null,null,null,null,null,null,null,null,null,null,null,null,null,null,null,null,null,null,null,null,null,null,null,null,null,null,null,null,null,null,null,null,null,null,null,null,null,null,null,null,null,null,null,null,null,null,null,null,null,null,null,null,null,null,null,null,null,null,null,null,null,null,null,null,null,null,null,null,null,null,null,null,null,null,null,null,null,null,null,null,null,null,null,null,null,null,null,null,null,null,null,null,null,null,null,{"$f":"IF($I$3=\"Deutsch\",$A302,IF($I$3=\"English\",$B302,IF($I$3=\"Français\",$C302,IF($I$3=\"Italiano\",$D302,IF($I$3=\"Nederlands\",$E302,\"\")))))","v":""},2]
[{"$f":"$I$300","v":"(A2) - Europrofil\n- hængende Montage [70-110 mm]"},"A2",2,3,1,1,1,null,null,{"$f":"HLOOKUP($I$3,$A$234:$G$348,66,FALSE)","v":"(A1) - Europrofil\n- hængende Montage [70-79 mm]"},null,null,null,"59-80 mm (M)","58-77 mm (M)",null,1,{"$f":"IF($I$3=\"Deutsch\",$A271,IF($I$3=\"English\",$B271,IF($I$3=\"Français\",$C271,IF($I$3=\"Italiano\",$D271,IF($I$3=\"Nederlands\",$E271,\"\")))))","v":""},null,null,null,null,null,null,null,null,null,null,null,null,null,null,null,null,null,null,null,null,null,null,null,null,null,null,null,null,null,null,null,null,null,null,null,null,null,null,null,null,null,null,null,null,null,null,null,null,null,null,null,null,null,null,null,null,null,null,null,null,null,null,null,null,null,null,null,null,null,null,null,null,null,null,null,null,null,null,null,null,null,null,null,null,null,null,null,null,null,null,null,null,null,null,null,null,null,null,null,null,null,null,null,null,null,null,null,null,null,null,null,null,null,null,null,null,null,null,null,null,null,null,null,{"$f":"IF($I$3=\"Deutsch\",$A276,IF($I$3=\"English\",$B276,IF($I$3=\"Français\",$C276,IF($I$3=\"Italiano\",$D276,IF($I$3=\"Nederlands\",$E276,\"\")))))","v":""},1]
[{"$f":"$I$267","v":"(A3) - Europrofile - opretstående montering til rørformede døre"},"A3",1,1,2,2,2,null,null,{"$f":"HLOOKUP($I$3,$A$234:$G$348,67,FALSE)","v":"(A2) - Europrofil\n- hængende Montage [70-110 mm]"},null,null,null,"79-100 mm (L)","78-97 mm (L)",null,4,null,null,null,null,null,null,null,null,null,null,null,null,null,null,null,null,null,null,null,null,null,null,null,null,null,null,null,null,null,null,null,null,null,null,null,null,null,null,null,null,null,null,null,null,null,null,null,null,null,null,null,null,null,null,null,null,null,null,null,null,null,null,null,null,null,null,null,null,null,null,null,null,null,null,null,null,null,null,null,null,null,null,null,null,null,null,null,null,null,null,null,null,null,null,null,null,null,null,null,null,null,null,null,null,null,null,null,null,null,null,null,null,null,null,null,null,null,null,null,null,null,null,null,null,{"$f":"IF($I$3=\"Deutsch\",$A277,IF($I$3=\"English\",$B277,IF($I$3=\"Français\",$C277,IF($I$3=\"Italiano\",$D277,IF($I$3=\"Nederlands\",$E277,\"\")))))","v":""},1]
[{"$f":"$I$302","v":"(E0) - Skandinavisk Oval\n- uden låsecylinderåbning / stående montage"},"E0",2,3,1,1,1,null,null,null,null,null,null,"100-200 mm (X)","97-196 mm (X)",null,4,null,null,null,null,null,null,null,null,null,null,null,null,null,null,null,null,null,null,null,null,null,null,null,null,null,null,null,null,null,null,null,null,null,null,null,null,null,null,null,null,null,null,null,null,null,null,null,null,null,null,null,null,null,null,null,null,null,null,null,null,null,null,null,null,null,null,null,null,null,null,null,null,null,null,null,null,null,null,null,null,null,null,null,null,null,null,null,null,null,null,null,null,null,null,null,null,null,null,null,null,null,null,null,null,null,null,null,null,null,null,null,null,null,null,null,null,null,null,null,null,null,null,null,null,{"$f":"IF($I$3=\"Deutsch\",$A278,IF($I$3=\"English\",$B278,IF($I$3=\"Français\",$C278,IF($I$3=\"Italiano\",$D278,IF($I$3=\"Nederlands\",$E278,\"\")))))","v":""},3]
[{"$f":"$I$303","v":"(E1) - Skandinavisk Oval\n- med låsecylinderåbning  / stående montage"},"E1",2,3,1,1,1,null,null,"Außenrosette/Innenrosette",null,null,null,null,null,null,4,"für MO / blind",null,null,null,null,null,null,null,null,null,null,null,null,null,null,null,null,null,null,null,null,null,null,null,null,null,null,null,null,null,null,null,null,null,null,null,null,null,null,null,null,null,null,null,null,null,null,null,null,null,null,null,null,null,null,null,null,null,null,null,null,null,null,null,null,null,null,null,null,null,null,null,null,null,null,null,null,null,null,null,null,null,null,null,null,null,null,null,null,null,null,null,null,null,null,null,null,null,null,null,null,null,null,null,null,null,null,null,null,null,null,null,null,null,null,null,null,null,null,null,null,null,null,null,{"$f":"IF($I$3=\"Deutsch\",$A275,IF($I$3=\"English\",$B275,IF($I$3=\"Français\",$C275,IF($I$3=\"Italiano\",$D275,IF($I$3=\"Nederlands\",$E275,\"\")))))","v":""},3]
[{"$f":"$J$348","v":"(B0) - Swiss Round\n- stående montage"},"B0",1,1,1,1,1,null,null,1,2,3,4,null,null,null,null,1,2,3,4,5]
[{"$f":"$J$349","v":"(B1) - Swiss Round\n- hængende montage [70-79 mm]"},"B1",2,3,1,1,1,null,null,{"$f":"HLOOKUP($I$3,$A$234:$G$348,62,FALSE)&\" (0)\"","v":"uden roset (0)"},{"$f":"HLOOKUP($I$3,$A$234:$G$348,62,FALSE)&\" (0)\"","v":"uden roset (0)"},{"$f":"HLOOKUP($I$3,$A$234:$G$348,63,FALSE)&\" (1)\"","v":"uden låsecylinder-åbning (1)"},{"$f":"HLOOKUP($I$3,$A$234:$G$348,62,FALSE)&\" (0)\"","v":"uden roset (0)"},null,null,null,null,{"$f":"IF($I$3=\"Deutsch\",$A267,IF($I$3=\"English\",$B267,IF($I$3=\"Français\",$C267,IF($I$3=\"Italiano\",$D267,IF($I$3=\"Nederlands\",$E267,\"\")))))","v":""},{"$f":"IF($I$3=\"Deutsch\",$A272,IF($I$3=\"English\",$B272,IF($I$3=\"Français\",$C272,IF($I$3=\"Italiano\",$D272,IF($I$3=\"Nederlands\",$E272,\"\")))))","v":""},{"$f":"IF($I$3=\"Deutsch\",$A267,IF($I$3=\"English\",$B267,IF($I$3=\"Français\",$C267,IF($I$3=\"Italiano\",$D267,IF($I$3=\"Nederlands\",$E267,\"\")))))","v":""},{"$f":"IF($I$3=\"Deutsch\",$A267,IF($I$3=\"English\",$B267,IF($I$3=\"Français\",$C267,IF($I$3=\"Italiano\",$D267,IF($I$3=\"Nederlands\",$E267,\"\")))))","v":""},{"$f":"IF($I$3=\"Deutsch\",$A267,IF($I$3=\"English\",$B267,IF($I$3=\"Français\",$C267,IF($I$3=\"Italiano\",$D267,IF($I$3=\"Nederlands\",$E267,\"\")))))","v":""}]
[{"$f":"$J$350","v":"(B2) - Swiss Round\n- hængende Montage [70-110 mm]"},"B2",2,3,1,1,1,null,null,{"$f":"HLOOKUP($I$3,$A$234:$G$348,63,FALSE)&\" (1)\"","v":"uden låsecylinder-åbning (1)"},null,{"$f":"HLOOKUP($I$3,$A$234:$G$348,64,FALSE)&\" (2)\"","v":"med låsecylinder-åbning (2)"},null,null,null,null,null,{"$f":"IF($I$3=\"Deutsch\",$A268,IF($I$3=\"English\",$B268,IF($I$3=\"Français\",$C268,IF($I$3=\"Italiano\",$D268,IF($I$3=\"Nederlands\",$E268,\"\")))))","v":""},{"$f":"IF($I$3=\"Deutsch\",$A273,IF($I$3=\"English\",$B273,IF($I$3=\"Français\",$C273,IF($I$3=\"Italiano\",$D273,IF($I$3=\"Nederlands\",$E273,\"\")))))","v":""},{"$f":"IF($I$3=\"Deutsch\",$A268,IF($I$3=\"English\",$B268,IF($I$3=\"Français\",$C268,IF($I$3=\"Italiano\",$D268,IF($I$3=\"Nederlands\",$E268,\"\")))))","v":""},{"$f":"IF($I$3=\"Deutsch\",$A269,IF($I$3=\"English\",$B269,IF($I$3=\"Français\",$C269,IF($I$3=\"Italiano\",$D269,IF($I$3=\"Nederlands\",$E269,\"\")))))","v":""},{"$f":"IF($I$3=\"Deutsch\",$A268,IF($I$3=\"English\",$B268,IF($I$3=\"Français\",$C268,IF($I$3=\"Italiano\",$D268,IF($I$3=\"Nederlands\",$E268,\"\")))))","v":""},null,null,null,null,null,null,null,null,null,null,null,null,null,null,null,null,null,null,null,null,null,null,null,null,null,null,null,null,null,null,null,null,null,null,null,null,null,null,null,null,null,null,null,null,null,null,null,null,null,null,null,null,null,null,null,null,null,null,null,null,null,null,null,null,null,null,null,null,null,null,null,null,null,null,null,null,null,null,null,null,null,null,null,null,null,null,null,null,null,null,null,null,null,null,null,null,null,null,null,null,null,null,null,null,null,null,null,null,null,null,null,null,null,null,null,null,null,null,null,"Montageform"]
[{"$f":"$I$380","v":"EuroPZ, stående montage til panikstangsadaption - (A4)"},"A4",2,2,null,3,1,null,null,{"$f":"HLOOKUP($I$3,$A$234:$G$348,64,FALSE)&\" (2)\"","v":"med låsecylinder-åbning (2)"},null,null,null,null,null,null,0,{"$f":"IF($I$3=\"Deutsch\",$A269,IF($I$3=\"English\",$B269,IF($I$3=\"Français\",$C269,IF($I$3=\"Italiano\",$D269,IF($I$3=\"Nederlands\",$E269,\"\")))))","v":""},{"$f":"IF($I$3=\"Deutsch\",$A274,IF($I$3=\"English\",$B274,IF($I$3=\"Français\",$C274,IF($I$3=\"Italiano\",$D274,IF($I$3=\"Nederlands\",$E274,\"\")))))","v":""},{"$f":"IF($I$3=\"Deutsch\",$A269,IF($I$3=\"English\",$B269,IF($I$3=\"Français\",$C269,IF($I$3=\"Italiano\",$D269,IF($I$3=\"Nederlands\",$E269,\"\")))))","v":""},null,{"$f":"IF($I$3=\"Deutsch\",$A269,IF($I$3=\"English\",$B269,IF($I$3=\"Français\",$C269,IF($I$3=\"Italiano\",$D269,IF($I$3=\"Nederlands\",$E269,\"\")))))","v":""},null,null,null,null,null,null,null,null,null,null,null,null,null,null,null,null,null,null,null,null,null,null,null,null,null,null,null,null,null,null,null,null,null,null,null,null,null,null,null,null,null,null,null,null,null,null,null,null,null,null,null,null,null,null,null,null,null,null,null,null,null,null,null,null,null,null,null,null,null,null,null,null,null,null,null,null,null,null,null,null,null,null,null,null,null,null,null,null,null,null,null,null,null,null,null,null,null,null,null,null,null,null,null,null,null,null,null,null,null,null,null,null,null,null,null,null,null,null,null,{"$f":"IF($I$3=\"Deutsch\",$A270,IF($I$3=\"English\",$B270,IF($I$3=\"Français\",$C270,IF($I$3=\"Italiano\",$D270,IF($I$3=\"Nederlands\",$E270,\"\")))))","v":""}]
[null,null,null,null,null,null,null,null,null,null,null,null,null,null,null,null,1,null,null,null,null,null,null,null,null,null,null,null,null,null,null,null,null,null,null,null,null,null,null,null,null,null,null,null,null,null,null,null,null,null,null,null,null,null,null,null,null,null,null,null,null,null,null,null,null,null,null,null,null,null,null,null,null,null,null,null,null,null,null,null,null,null,null,null,null,null,null,null,null,null,null,null,null,null,null,null,null,null,null,null,null,null,null,null,null,null,null,null,null,null,null,null,null,null,null,null,null,null,null,null,null,null,null,null,null,null,null,null,null,null,null,null,null,null,null,null,null,null,null,null,null,{"$f":"IF($I$3=\"Deutsch\",$A271,IF($I$3=\"English\",$B271,IF($I$3=\"Français\",$C271,IF($I$3=\"Italiano\",$D271,IF($I$3=\"Nederlands\",$E271,\"\")))))","v":""}]
[]
[]
[]
[]
[]
[null,null,null,null,null,null,null,null,null,null,"(VCN) Virtual Card Network",".VCN","Virtual Card Network"]
[null,null,null,null,null,null,null,null,null,null,"(WO) Wireless Online",".WO","Wireless Online"]
[null,null,null,null,null,null,null,null,null,null,"(ER) Escape & Return",".ER","Escape & Return"]
[null,null,null,null,null,null,null,null,null,null,"(ER.VCN) Escape & Return / Virtual Card Network",".ER.VCN",{"$f":"\"Escape & Return\"&\", Virtual Card Network\"","v":"Escape & Return, Virtual Card Network"}]
[null,null,null,null,null,null,null,null,null,null,"(ER.WO) Escape & Return / Wireless Online",".ER.WO",{"$f":"\"Escape & Return\"&\", Wireless Online\"","v":"Escape & Return, Wireless Online"}]
[null,null,null,null,null,null,null,null,null,null,null,{"$f":"J340","v":"fås ikke"},"  "]
[]
[]
[]
[]
[]
[null,null,null,null,"für Option","für Außendrücker","für Vierkant","für Türdicken",null,null,"Option",null,null,null,null,"Außendrücker",null,null,null,null,null,"Vierkant"]
["Zeile 17",null,{"$f":"VLOOKUP(E17,$A$44:$C$53,3,FALSE)","v":2},{"$f":"VLOOKUP(E17,$A$44:$D$53,4,FALSE)","v":3},{"$f":"VLOOKUP(M17,$K$85:$M$86,3,FALSE)+VLOOKUP(E17,$A$44:$H$53,8,FALSE)","v":1},{"$f":"VLOOKUP(E17,$A$44:$E$52,5,FALSE)+B158","v":2},{"$f":"VLOOKUP(E17,$A$44:$F$53,6,FALSE)","v":1},{"$f":"VLOOKUP(E17,$A$44:$G$53,7,FALSE)","v":1},null,null,1,2,3,4,null,1,2,3,null,null,null,1,{"$f":"VLOOKUP(C7,O44:Q49,3,FALSE)+VLOOKUP(C8,O53:Q54,3,FALSE)","v":{"$error":"#N/A"}},null,null,null,null,null,null,null,null,null,null,null,null,null,null,null,null,null,null,null,null,null,null,null,null,null,null,null,null,null,null,null,null,null,null,null,null,null,null,null,null,null,null,null,null,null,null,null,null,null,null,null,null,null,null,null,null,null,null,null,null,null,null,null,null,null,null,null,null,null,null,null,null,null,null,null,null,null,null,null,null,null,null,null,null,null,null,null,null,null,null,null,null,null,null,null,null,null,null,null,null,null,null,null,null,null,null,null,null,null,null,null,null,null,null,null,null,2,3,"Zelle E8"]
["Zeile 18",null,{"$f":"VLOOKUP(E18,$A$44:$C$53,3,FALSE)","v":{"$error":"#N/A"}},{"$f":"VLOOKUP(E18,$A$44:$D$53,4,FALSE)","v":{"$error":"#N/A"}},{"$error":"#N/A"},{"$f":"VLOOKUP(E18,$A$44:$E$52,5,FALSE)","v":{"$error":"#N/A"}},{"$f":"VLOOKUP(E18,$A$44:$F$53,6,FALSE)","v":{"$error":"#N/A"}},{"$f":"VLOOKUP(E18,$A$44:$G$53,7,FALSE)","v":{"$error":"#N/A"}},null,null,"(VCN) Virtual Card Network",{"$f":"$J$340","v":"fås ikke"},{"$f":"HLOOKUP($I$3,$A$234:$G$358,108,FALSE)","v":"kræves ikke"},{"$f":"$J$340","v":"fås ikke"},null,{"$f":"HLOOKUP($I$3,$A$234:$G$348,71,FALSE)","v":"L-form rund (A )"},{"$f":"I317","v":"U-form buet og drejet (L)"},{"$f":"HLOOKUP($I$3,$A$234:$G$348,73,FALSE)","v":"U-form rund (C)"},null,null,null,"07",null,null,null,null,null,null,null,null,null,null,null,null,null,null,null,null,null,null,null,null,null,null,null,null,null,null,null,null,null,null,null,null,null,null,null,null,null,null,null,null,null,null,null,null,null,null,null,null,null,null,null,null,null,null,null,null,null,null,null,null,null,null,null,null,null,null,null,null,null,null,null,null,null,null,null,null,null,null,null,null,null,null,null,null,null,null,null,null,null,null,null,null,null,null,null,null,null,null,null,null,null,null,null,null,null,null,null,null,null,null,null,null,null,null,null,null,null,"08","09"]
["Zeile 19",null,{"$error":"#N/A"},{"$error":"#N/A"},{"$error":"#N/A"},{"$error":"#N/A"},{"$error":"#N/A"},{"$error":"#N/A"},null,null,"(WO) Wireless Online",null,".ZK",null,null,{"$f":"HLOOKUP($I$3,$A$234:$G$348,72,FALSE)","v":"L-form  gering (B)"},null,{"$f":"HLOOKUP($I$3,$A$234:$G$348,74,FALSE)","v":"U-form  gering (D)"},null,null,null,"08",null,null,null,null,null,null,null,null,null,null,null,null,null,null,null,null,null,null,null,null,null,null,null,null,null,null,null,null,null,null,null,null,null,null,null,null,null,null,null,null,null,null,null,null,null,null,null,null,null,null,null,null,null,null,null,null,null,null,null,null,null,null,null,null,null,null,null,null,null,null,null,null,null,null,null,null,null,null,null,null,null,null,null,null,null,null,null,null,null,null,null,null,null,null,null,null,null,null,null,null,null,null,null,null,null,null,null,null,null,null,null,null,null,null,null,null,null,"09"]
["Zeile 20",null,{"$error":"#N/A"},{"$error":"#N/A"},{"$error":"#N/A"},{"$error":"#N/A"},{"$error":"#N/A"},{"$error":"#N/A"},null,null,"(ER) Escape & Return",null,null,null,null,{"$f":"HLOOKUP($I$3,$A$234:$G$348,73,FALSE)","v":"U-form rund (C)"},null,{"$f":"I317","v":"U-form buet og drejet (L)"},null,null,null,"09"]
["Zeile 21",null,{"$error":"#N/A"},{"$error":"#N/A"},{"$error":"#N/A"},{"$error":"#N/A"},{"$error":"#N/A"},{"$error":"#N/A"},null,null,"(ER.VCN) Escape & Return / Virtual Card Network",null,null,null,null,{"$f":"HLOOKUP($I$3,$A$234:$G$348,74,FALSE)","v":"U-form  gering (D)"},null,null,null,null,null,10]
["Zeile 22",null,{"$error":"#N/A"},{"$error":"#N/A"},{"$error":"#N/A"},{"$error":"#N/A"},{"$error":"#N/A"},{"$error":"#N/A"},null,null,"(ER.WO) Escape & Return / Wireless Online",null,null,null,null,{"$f":"I317","v":"U-form buet og drejet (L)"}]
["Zeile 23",null,{"$error":"#N/A"},{"$error":"#N/A"},{"$error":"#N/A"},{"$error":"#N/A"},{"$error":"#N/A"},{"$error":"#N/A"},null,null,null,null,null,null,null,{"$f":"HLOOKUP($I$3,$A$234:$G$348,75,FALSE)","v":"Uden håndtag (O)"}]
["Zeile 24",null,{"$error":"#N/A"},{"$error":"#N/A"},{"$error":"#N/A"},{"$error":"#N/A"},{"$error":"#N/A"},{"$error":"#N/A"}]
[]
[]
[]
[]
["Türdicke in mm","S / M / L",null,"Vierkant",null,null,null,"Drücker außen / innen",null,null,"Lesetechnik",null,null,null,"Version",null,"für Lesetechnik","für Optionen","Lesetechnik",null,null,"für Lesetechnik"]
["38-60 mm (S)","S",null,"07",null,null,null,{"$f":"HLOOKUP($I$3,$A$234:$G$348,71,FALSE)","v":"L-form rund (A )"},"A",null,{"$f":"HLOOKUP($I$3,$A$234:$G$348,81,FALSE)","v":"(M) SmartCards / SmartTags"},"M",1,null,0,"eingekuppelt",1,1,0,"ohne Elektronik",null,0]
["59-80 mm (M)","M",null,"08",null,null,null,{"$f":"HLOOKUP($I$3,$A$234:$G$348,72,FALSE)","v":"L-form  gering (B)"},"B",null,{"$f":"HLOOKUP($I$3,$A$234:$G$348,83,FALSE)","v":"(0) Uden elektronik"},0,2,null,1,"einseitig lesend",2,2,1,"aktiv",null,0]
["79-100 mm (L)","L",null,"09",null,null,null,{"$f":"HLOOKUP($I$3,$A$234:$G$348,73,FALSE)","v":"U-form rund (C)"},"C",null,null,null,null,null,2,"einseitig lesend /DM",null,2,2,"Hybrid Mifare",null,0]
["100-200 mm (X)","X",null,10,null,null,null,{"$f":"HLOOKUP($I$3,$A$234:$G$348,74,FALSE)","v":"U-form  gering (D)"},"D",null,null,null,null,null,3,"einseitig lesend /DM S",null,2,3,"Mifare"]
["38-57 mm (S)","S","für Rohrrahmen (A3)",null,null,null,null,{"$f":"I317","v":"U-form buet og drejet (L)"},"L",null,null,null,null,null,4,"einseitig lesend /DND",null,2,4,"Legic"]
["58-77 mm (M)","M","für Rohrrahmen (A3)",null,null,null,null,{"$f":"HLOOKUP($I$3,$A$234:$G$348,75,FALSE)","v":"Uden håndtag (O)"},0,null,null,null,null,null,5,"beidseitig lesend /DM",null,2,"A","Mifare NW"]
["78-97 mm (L)","L","für Rohrrahmen (A3)",null,null,null,null,{"$f":"$J$340","v":"fås ikke"},0,null,null,null,null,null,6,"beidseitig lesend /DM S",null,2,"B","Legic NW"]
["97-196 mm (X)","X","für Rohrrahmen (A3)",null,null,null,null,null,null,null,null,null,null,null,7,"beidseitig lesend /DND",null,2]
[]
[]
[null,null,null,null,null,null,null,null,null,null,null,null,null,null,null,null,"für Lesetechnik","für Optionen",null,"für Lesetechnik",null,null,null,"für Optionen"]
["Oberfläche",null,null,"Option",null,null,null,"Außen-/Innenrosette",null,null,null,null,null,null,"Zeile 17",null,{"$f":"VLOOKUP(#REF!,$O$85:$Q$92,3,FALSE)+VLOOKUP(M17,$S$85:$V$91,3,FALSE)","v":{"$error":"#REF!"}},{"$f":"VLOOKUP(#REF!,$O$85:$R$92,4,FALSE)","v":{"$error":"#REF!"}},null,1,null,2,null,1,2]
[{"$f":"HLOOKUP($I$3,$A$234:$G$348,78,FALSE)&\" (1)\"","v":"sølv / sort grå (1)"},1,null,{"$f":"HLOOKUP($I$3,$A$234:$G$358,108,FALSE)","v":"kræves ikke"},null,null,null,{"$f":"HLOOKUP($I$3,$A$234:$G$348,62,FALSE)&\" (0)\"","v":"uden roset (0)"},0,null,null,null,null,null,"Zeile 18",null,{"$f":"VLOOKUP(#REF!,$O$85:$Q$92,3,FALSE)+VLOOKUP(M18,$S$85:$V$91,3,FALSE)","v":{"$error":"#REF!"}},{"$f":"VLOOKUP(#REF!,$O$85:$R$92,4,FALSE)","v":{"$error":"#REF!"}},null,0,null,1,null,{"$f":"J340","v":"fås ikke"},{"$f":"J341","v":"kræves ikke"}]
[{"$f":"HLOOKUP($I$3,$A$234:$G$348,79,FALSE)&\" (2)\"","v":"sølv / hvid (2)"},2,null,".ZK",{"$f":"HLOOKUP($I$3,$A$234:$G$286,53,FALSE)","v":", med ZK"},null,null,{"$f":"HLOOKUP($I$3,$A$234:$G$348,63,FALSE)&\" (1)\"","v":"uden låsecylinder-åbning (1)"},1,null,null,null,null,null,"Zeile 19",null,{"$f":"VLOOKUP(#REF!,$O$85:$Q$92,3,FALSE)+VLOOKUP(M19,$S$85:$V$91,3,FALSE)","v":{"$error":"#REF!"}},{"$f":"VLOOKUP(#REF!,$O$85:$R$92,4,FALSE)","v":{"$error":"#REF!"}},null,null,null,2,null,null,"ZK"]
[{"$f":"I362&\" (7)\"","v":"messing / hvid (7)"},7,null,".FH",{"$f":"HLOOKUP($I$3,$A$234:$G$348,76,FALSE)","v":", godkendt til branddøre"},null,null,{"$f":"HLOOKUP($I$3,$A$234:$G$348,64,FALSE)&\" (2)\"","v":"med låsecylinder-åbning (2)"},2,null,null,null,null,null,"Zeile 20",null,{"$f":"VLOOKUP(#REF!,$O$85:$Q$92,3,FALSE)+VLOOKUP(M20,$S$85:$V$91,3,FALSE)","v":{"$error":"#REF!"}},{"$f":"VLOOKUP(#REF!,$O$85:$R$92,4,FALSE)","v":{"$error":"#REF!"}}]
[null,null,null,".ZK.FH",{"$f":"E98&E99","v":", med ZK, godkendt til branddøre"},null,null,null,null,null,null,null,null,null,"Zeile 21",null,{"$f":"VLOOKUP(#REF!,$O$85:$Q$92,3,FALSE)+VLOOKUP(M21,$S$85:$V$91,3,FALSE)","v":{"$error":"#REF!"}},{"$f":"VLOOKUP(#REF!,$O$85:$R$92,4,FALSE)","v":{"$error":"#REF!"}}]
[null,null,null,{"$f":"J340","v":"fås ikke"},null,null,null,null,null,null,null,null,null,null,"Zeile 22",null,{"$f":"VLOOKUP(#REF!,$O$85:$Q$92,3,FALSE)+VLOOKUP(M22,$S$85:$V$91,3,FALSE)","v":{"$error":"#REF!"}},{"$f":"VLOOKUP(#REF!,$O$85:$R$92,4,FALSE)","v":{"$error":"#REF!"}}]
[null,null,null,null,null,null,null,null,null,null,null,null,null,null,"Zeile 23",null,{"$f":"VLOOKUP(#REF!,$O$85:$Q$92,3,FALSE)+VLOOKUP(M23,$S$85:$V$91,3,FALSE)","v":{"$error":"#REF!"}},{"$f":"VLOOKUP(#REF!,$O$85:$R$92,4,FALSE)","v":{"$error":"#REF!"}}]
[null,null,null,null,null,null,null,null,null,null,null,null,null,null,"Zeile 24",null,{"$f":"VLOOKUP(#REF!,$O$85:$Q$92,3,FALSE)+VLOOKUP(M24,$S$85:$V$91,3,FALSE)","v":{"$error":"#REF!"}},{"$f":"VLOOKUP(#REF!,$O$85:$R$92,4,FALSE)","v":{"$error":"#REF!"}}]
[]
[]
[]
[]
[]
[]
[]
["Profil",null,"Bildansicht außen","Bildansicht innen",null,null,null,"für Variantencode aus Profil/Montageform/MO"]
[{"$f":"$I$260","v":"(A0) - Europrofil\n- stående Montage"},null,1,1,null,null,null,1,2,3,4,5,6,7,8,9,10,11,12,13,null,14,15,16,17,18,19,20,21,22,23,null,24,25,26]
[{"$f":"$I$299","v":"(A1) - Europrofil\n- hængende Montage [70-79 mm]"},null,4,1,null,null,null,"A0","A1","A2","E0","E1"]
[{"$f":"$I$300","v":"(A2) - Europrofil\n- hængende Montage [70-110 mm]"},null,11,1]
[{"$f":"$I$267","v":"(A3) - Europrofile - opretstående montering til rørformede døre"},null,1,1]
[{"$f":"$I$302","v":"(E0) - Skandinavisk Oval\n- uden låsecylinderåbning / stående montage"},null,5,4]
[{"$f":"$I$303","v":"(E1) - Skandinavisk Oval\n- med låsecylinderåbning  / stående montage"},null,6,4]
[{"$f":"$J$348","v":"(B0) - Swiss Round\n- stående montage"},null,7,7]
[{"$f":"$J$349","v":"(B1) - Swiss Round\n- hængende montage [70-79 mm]"},null,4,7]
[{"$f":"$J$350","v":"(B2) - Swiss Round\n- hængende Montage [70-110 mm]"},null,11,7]
[]
[]
["außen"]
[{"$f":"HLOOKUP($I$3,$A$234:$G$348,62,FALSE)&\" (0)\"","v":"uden roset (0)"},null,0]
[{"$f":"HLOOKUP($I$3,$A$234:$G$348,63,FALSE)&\" (1)\"","v":"uden låsecylinder-åbning (1)"},null,1]
[{"$f":"HLOOKUP($I$3,$A$234:$G$348,64,FALSE)&\" (2)\"","v":"med låsecylinder-åbning (2)"},null,2]
[]
[null,null,null,null,"für Beschriftung unter Bild"]
[null,"Bildansicht außen",{"$f":"VLOOKUP(C7,A112:C120,3,FALSE)+VLOOKUP(C8,A124:C126,3,FALSE)","v":6},{"$f":"IF(ISERROR(C129),\"XXX\",\"A\"&C129&\"_\")","v":"A6_"},{"$f":"IF($C$129=4,$I$355,IF($C$129=11,$I$356,\"\"))","v":""}]
[null,"Bildansicht innen",{"$f":"VLOOKUP(C7,A112:D120,4,FALSE)+VLOOKUP(C9,A124:C126,3,FALSE)","v":5},{"$f":"IF(ISERROR(C130),\"XXX\",\"I\"&C130&\"_\")","v":"I5_"}]
[]
[]
[null,null,null,null,null,null,null,"für Variantencode aus Profil/Montageform/MO --> zur Ansicht der Zeichnungen"]
[null,null,null,null,null,null,null,1,2,3,4,5,6,7,8,9,10,11,12,13,14,15,16,17,18,19,null,20,21,22,23,null,24,25,26,"XXX"]
[null,null,"für Variantencode aus Profil/Montageform/MO",null,null,null,null,"A0","A1_","A2_","B0","B1_","B2_","C0","_C1","CX","D0","D1_","DX","E0","E1_","E2_","F0","F1","G0","G1",null,"G2","H0","H1","H2",null,"I0","I1","I2","\"SV-Logo\""]
["Zeile 17",null,null,{"$f":"IF(ISERROR(C136),\"\",CHOOSE(C136,$H$113,$I$113,$J$113,$K$113,$L$113))","v":{"$error":"#VALUE!"}}]
["Zeile 18",null,null,{"$error":"#VALUE!"}]
["Zeile 19",null,null,{"$error":"#VALUE!"}]
["Zeile 20",null,null,{"$error":"#VALUE!"},null,null,"für Zeichnung (E8)"]
["Zeile 21",null,null,{"$error":"#VALUE!"},null,"Profil",{"$f":"VLOOKUP(C7,A44:B53,2,FALSE)","v":"E1"},{"$f":"IF(OR(C7=\"\",C8=\"\",C9=\"\"),\"XXX\",CHOOSE(G140,H135,I135,J135,K135,L135,M135,N135,O135,P135,Q135,R135,S135,T135,U135,V135,AJ135))","v":{"$error":"#VALUE!"}}]
["Zeile 22",null,null,{"$error":"#VALUE!"},null,"Außenrosette"]
["Zeile 23",null,null,{"$error":"#VALUE!"},null,"Innenrosette"]
["Zeile 24",null,null,{"$error":"#VALUE!"}]
[]
[null,null,null,null,"FH (Abhängigkeit Drücker)"]
["für (Brand-)Schutz"]
[null,null,null,null,"außen ohne FH","außen mit FH","innen ohne FH ausser A3","innen mit FH ausser A3","innen ohne FH für A3","innen mit FH für A3","innen mit FH für A4"]
[{"$f":"HLOOKUP($I$3,$A$234:$G$358,108,FALSE)","v":"kræves ikke"},1,1,null,1,2,3,4,5,6,7]
[{"$f":"I382","v":"godkendt til FH-døre"},2,2,".FH",{"$f":"HLOOKUP($I$3,$A$234:$G$348,71,FALSE)","v":"L-form rund (A )"},{"$f":"HLOOKUP($I$3,$A$234:$G$348,73,FALSE)","v":"U-form rund (C)"},{"$f":"HLOOKUP($I$3,$A$234:$G$348,71,FALSE)","v":"L-form rund (A )"},{"$f":"HLOOKUP($I$3,$A$234:$G$348,73,FALSE)","v":"U-form rund (C)"},{"$f":"I317","v":"U-form buet og drejet (L)"},{"$f":"I317","v":"U-form buet og drejet (L)"},{"$f":"HLOOKUP($I$3,$A$234:$G$348,75,FALSE)","v":"Uden håndtag (O)"}]
["PAS24",3,1,".PAS",{"$f":"HLOOKUP($I$3,$A$234:$G$348,72,FALSE)","v":"L-form  gering (B)"},{"$f":"HLOOKUP($I$3,$A$234:$G$348,74,FALSE)","v":"U-form  gering (D)"},{"$f":"HLOOKUP($I$3,$A$234:$G$348,72,FALSE)","v":"L-form  gering (B)"},{"$f":"HLOOKUP($I$3,$A$234:$G$348,74,FALSE)","v":"U-form  gering (D)"}]
[{"$f":"I382&\" & PAS24\"","v":"godkendt til FH-døre & PAS24"},3,2,".FH.PAS",{"$f":"HLOOKUP($I$3,$A$234:$G$348,73,FALSE)","v":"U-form rund (C)"},{"$f":"I317","v":"U-form buet og drejet (L)"},{"$f":"HLOOKUP($I$3,$A$234:$G$348,73,FALSE)","v":"U-form rund (C)"},{"$f":"I317","v":"U-form buet og drejet (L)"}]
[null,null,null,null,{"$f":"HLOOKUP($I$3,$A$234:$G$348,74,FALSE)","v":"U-form  gering (D)"},null,{"$f":"HLOOKUP($I$3,$A$234:$G$348,74,FALSE)","v":"U-form  gering (D)"}]
[null,null,null,null,{"$f":"I317","v":"U-form buet og drejet (L)"},null,{"$f":"I317","v":"U-form buet og drejet (L)"}]
[null,null,null,null,{"$f":"HLOOKUP($I$3,$A$234:$G$348,75,FALSE)","v":"Uden håndtag (O)"},null,{"$f":"HLOOKUP($I$3,$A$234:$G$348,75,FALSE)","v":"Uden håndtag (O)"}]
[]
[]
[null,"Profile","Drücker aussen","Drücker innen","Drücker innen Panik","PAS24 (Abhängigkeit zu Profil)",null,null,null,null,null,null,null,"A0",{"$f":"$A$112","v":"(A0) - Europrofil\n- stående Montage"}]
["Zeile 17",{"$f":"VLOOKUP(D17,$A$148:$B$151,2,FALSE)+IF(C17<>\"\",VLOOKUP(C17,$B$186:$E$193,3,FALSE),0)","v":1},{"$f":"VLOOKUP(D17,$A$148:$C$151,3,FALSE)+VLOOKUP(E17,$A$170:$C$179,3,FALSE)","v":1},{"$f":"VLOOKUP(D17,$A$148:$C$151,3,FALSE)+VLOOKUP(E17,$A$170:$D$179,4,FALSE)","v":3},{"$f":"IF(B186<>\"\",1,\"\")","v":""},1,2,3,4,null,null,null,null,"A1",{"$f":"$A$113","v":"(A1) - Europrofil\n- hængende Montage [70-79 mm]"}]
["Zeile 18",{"$f":"VLOOKUP(D18,$A$148:$B$151,2,FALSE)+IF(C18<>\"\",VLOOKUP(C18,$B$186:$E$193,3,FALSE),0)","v":{"$error":"#N/A"}},{"$f":"VLOOKUP(D18,$A$148:$C$151,3,FALSE)+VLOOKUP(E18,$A$170:$C$179,3,FALSE)","v":{"$error":"#N/A"}},{"$error":"#N/A"},{"$f":"IF(B187<>\"\",1,\"\")","v":""},{"$f":"$I$260","v":"(A0) - Europrofil\n- stående Montage"},{"$f":"$I$260","v":"(A0) - Europrofil\n- stående Montage"},{"$f":"$I$299","v":"(A1) - Europrofil\n- hængende Montage [70-79 mm]"},{"$f":"$I$380","v":"EuroPZ, stående montage til panikstangsadaption - (A4)"},null,null,null,null,"A2",{"$f":"$A$114","v":"(A2) - Europrofil\n- hængende Montage [70-110 mm]"}]
["Zeile 19",{"$error":"#N/A"},{"$error":"#N/A"},{"$error":"#N/A"},"",{"$f":"$I$299","v":"(A1) - Europrofil\n- hængende Montage [70-79 mm]"},{"$f":"$I$299","v":"(A1) - Europrofil\n- hængende Montage [70-79 mm]"},{"$f":"$I$300","v":"(A2) - Europrofil\n- hængende Montage [70-110 mm]"},null,null,null,null,null,"A3",{"$f":"$A$115","v":"(A3) - Europrofile - opretstående montering til rørformede døre"}]
["Zeile 20",{"$error":"#N/A"},{"$error":"#N/A"},{"$error":"#N/A"},"",{"$f":"$I$300","v":"(A2) - Europrofil\n- hængende Montage [70-110 mm]"},{"$f":"$I$300","v":"(A2) - Europrofil\n- hængende Montage [70-110 mm]"},null,null,null,null,null,null,"B0",{"$f":"$J$348","v":"(B0) - Swiss Round\n- stående montage"}]
["Zeile 21",{"$error":"#N/A"},{"$error":"#N/A"},{"$error":"#N/A"},"",{"$f":"$I$267","v":"(A3) - Europrofile - opretstående montering til rørformede døre"},{"$f":"$I$267","v":"(A3) - Europrofile - opretstående montering til rørformede døre"},null,null,null,null,null,null,"B1",{"$f":"$J$349","v":"(B1) - Swiss Round\n- hængende montage [70-79 mm]"}]
["Zeile 22",{"$error":"#N/A"},{"$error":"#N/A"},{"$error":"#N/A"},"",{"$f":"$I$302","v":"(E0) - Skandinavisk Oval\n- uden låsecylinderåbning / stående montage"},{"$f":"$I$302","v":"(E0) - Skandinavisk Oval\n- uden låsecylinderåbning / stående montage"},null,null,null,null,null,null,"B2",{"$f":"$J$350","v":"(B2) - Swiss Round\n- hængende Montage [70-110 mm]"}]
["Zeile 23",{"$error":"#N/A"},{"$error":"#N/A"},{"$error":"#N/A"},"",{"$f":"$I$303","v":"(E1) - Skandinavisk Oval\n- med låsecylinderåbning  / stående montage"},{"$f":"$I$303","v":"(E1) - Skandinavisk Oval\n- med låsecylinderåbning  / stående montage"},null,null,null,null,null,null,"C0",null,null,null,null,"Türdicke in mm","S / M / L"]
["Zeile 24",{"$error":"#N/A"},{"$error":"#N/A"},{"$error":"#N/A"},"",{"$f":"$J$348","v":"(B0) - Swiss Round\n- stående montage"},{"$f":"$J$348","v":"(B0) - Swiss Round\n- stående montage"},null,null,null,null,null,null,"C1",null,null,null,"Zeile 17",{"$f":"IF(K17<>\"\",K17,\"\")","v":"59-80 mm (M)"},{"$f":"VLOOKUP(S165,A85:B88,2,FALSE)","v":"M"}]
[null,null,null,null,null,{"$f":"$J$349","v":"(B1) - Swiss Round\n- hængende montage [70-79 mm]"},{"$f":"$J$349","v":"(B1) - Swiss Round\n- hængende montage [70-79 mm]"},null,null,null,null,null,null,"CX",null,null,null,"Zeile 18","",null,{"$f":"IF(S166=\"\",\"\",IF(AND(S166>=38,S166<=59),\"S\",IF(AND(S166>=60,S166<=79),\"M\",IF(AND(S166>=80,S166<=100),\"L\",$J$340))))","v":""}]
[null,null,null,null,null,{"$f":"$J$350","v":"(B2) - Swiss Round\n- hængende Montage [70-110 mm]"},{"$f":"$J$350","v":"(B2) - Swiss Round\n- hængende Montage [70-110 mm]"},null,null,null,null,null,null,"D0",null,null,null,"Zeile 19","",null,""]
[null,null,null,null,null,null,null,null,null,null,null,null,null,"D1",null,null,null,"Zeile 20","",null,""]
[null,null,null,"Drücker innen",null,null,null,null,null,null,null,null,null,"DX",null,null,null,"Zeile 21","",null,""]
[{"$f":"$I$260","v":"(A0) - Europrofil\n- stående Montage"},null,0,2,null,null,null,null,null,null,null,null,null,"E0",{"$f":"$A$117","v":"(E1) - Skandinavisk Oval\n- med låsecylinderåbning  / stående montage"},null,null,"Zeile 22","",null,""]
[{"$f":"$I$299","v":"(A1) - Europrofil\n- hængende Montage [70-79 mm]"},null,0,2,null,null,null,null,null,null,null,null,null,"E1",{"$f":"$A$116","v":"(E0) - Skandinavisk Oval\n- uden låsecylinderåbning / stående montage"},null,null,"Zeile 23","",null,""]
[{"$f":"$I$300","v":"(A2) - Europrofil\n- hængende Montage [70-110 mm]"},null,0,2,null,null,null,null,null,null,null,null,null,"E2",null,null,null,"Zeile 24","",null,""]
[{"$f":"$I$267","v":"(A3) - Europrofile - opretstående montering til rørformede døre"},null,0,4,null,null,null,null,null,null,null,null,null,"F0"]
[{"$f":"$I$302","v":"(E0) - Skandinavisk Oval\n- uden låsecylinderåbning / stående montage"},null,0,2,null,null,null,null,null,null,null,null,null,"F1"]
[{"$f":"$I$303","v":"(E1) - Skandinavisk Oval\n- med låsecylinderåbning  / stående montage"},null,0,2,null,null,null,null,null,null,null,null,null,"G0"]
[{"$f":"$J$348","v":"(B0) - Swiss Round\n- stående montage"},null,0,2,null,null,null,null,null,null,null,null,null,"G1"]
[{"$f":"$J$349","v":"(B1) - Swiss Round\n- hængende montage [70-79 mm]"},null,0,2,null,null,null,null,null,null,null,null,null,"G2"]
[{"$f":"$J$350","v":"(B2) - Swiss Round\n- hængende Montage [70-110 mm]"},null,0,2,null,null,null,null,null,null,null,null,null,"H0"]
[{"$f":"$I$380","v":"EuroPZ, stående montage til panikstangsadaption - (A4)"},null,0,5,null,null,null,null,null,null,null,null,null,"H1"]
[null,null,null,null,null,null,null,null,null,null,null,null,null,"H2"]
[null,null,null,null,null,null,null,null,null,null,null,null,null,"I0"]
[null,null,null,null,null,null,null,null,null,null,null,null,null,"I1"]
[null,null,null,null,null,null,null,null,null,null,null,null,null,"I2"]
[null,null,null,null,null,null,null,null,null,null,null,null,null,"A4",{"$f":"$I$380","v":"EuroPZ, stående montage til panikstangsadaption - (A4)"}]
[null,"Panikstangenbefestigung","Eintrag Spalte C","Auswahl für Brandschutz-Fluchttüren",null,"für Außen-/Innenrosette"]
["Zeile 17",null,{"$f":"IF(B186<>\"\",VLOOKUP(B186,$J$186:$K$188,2,FALSE),\"\")","v":""},{"$f":"IF(C186=\"\",1,2)","v":1},{"$f":"IF(C186=\"\",0,2)","v":0},{"$f":"IF(OR(C186=1,C186=2,),1,IF(C186=11,2,0))","v":0},null,null,null,{"$f":"HLOOKUP($I$3,$A$234:$G$377,142,FALSE)","v":"BKS fuldt dørblad, uden skilt, 92 mm"},1]
["Zeile 18",null,{"$f":"IF(B187<>\"\",VLOOKUP(B187,$J$186:$K$188,2,FALSE),\"\")","v":""},{"$f":"IF(C187=\"\",1,2)","v":1},{"$f":"IF(C187=\"\",0,2)","v":0},{"$f":"IF(OR(C187=1,C187=2,),1,IF(C187=11,2,0))","v":0},null,null,null,{"$f":"HLOOKUP($I$3,$A$234:$G$377,143,FALSE)","v":"BKS fuldt dørblad, uden skilt, 72 mm"},2]
["Zeile 19",null,"",1,0,0,null,null,null,{"$f":"HLOOKUP($I$3,$A$234:$G$377,144,FALSE)","v":"CISA fuldt dørblad (altid med skilt og 72 mm)"},11]
["Zeile 20",null,"",1,0,0]
["Zeile 21",null,"",1,0,0]
["Zeile 22",null,"",1,0,0]
["Zeile 23",null,"",1,0,0]
["Zeile 24",null,"",1,0,0]
[]
[]
[]
[null,null,1,2]
[null,null,{"$f":"HLOOKUP($I$3,$A$234:$G$358,108,FALSE)","v":"kræves ikke"},{"$f":"I382","v":"godkendt til FH-døre"}]
[null,null,{"$f":"I382","v":"godkendt til FH-døre"}]
[null,null,"PAS24"]
[null,null,{"$f":"I382&\" & PAS24\"","v":"godkendt til FH-døre & PAS24"}]
[]
[]
[]
[]
[null,"Lesetechnik"]
[null,{"$f":"I316","v":"(0) Uden elektronik"}]
[null,{"$f":"I314","v":"(M) SmartCards / SmartTags"}]
[]
[null,null,null,null,null,null,null,null,null,null,"A = L-shape curved\nB = L-shape mitre\nC = U-shape curved\nD = U-shape mitre","A = forme en L arrondie\nB =  forme en L rectangulaire\nC = forme en U arrondie\nD = forme en U rectangulaire","A = forma a L curvata tondeggiante\nB = forma a L piegata ad angolo retto\nC = forma a U curvata tondeggiante\nD = forma a U piegata ad angolo retto","A = L-vorm rond gebogen\nB =  L-vorm verstek\nC = U-vorm rond gebogen\nD = U-vorm verstek"]
[]
[]
[]
[]
[]
[]
[]
[]
[]
[]
[]
[]
[]
[]
[]
[]
[]
[]
[]
[]
[]
[]
[]
["Deutsch","English","Français","Italiano","Nederlands","Dansk","Svenska",null,{"$f":"HLOOKUP($I$3,A234:G282,1,FALSE)","v":"Dansk"},null,1]
["Bestellhilfe Digitales SmartHandle - AX","Ordering Guide Digital SmartHandle - AX","Guide de commande pour plaques béquilles - AX","Guida all'ordinazione di Smart Handle -AX","Bestelhulp Digitale SmartHandle - AX","Hjælp til bestilling af Digitalt SmartHandle - AX","Beställningsguide Digitalt SmartHandle - AX",null,null,null,2]
["*** Bitte Makros aktivieren ***","*** Please enable macros ***","*** S'il vous plaît activer les macros ***","*** Si prega di abilitare le macro ***","*** Macro’s inschakelen ***","*** aktiver makros ***","*** Du måste aktivera makron ***",{"$f":"HLOOKUP('Hauptseite - main page'!G3,'Bestellhilfe - ordering guide'!A234:G236,3,FALSE)","v":"*** aktiver makros ***"},null,null,3]
["Drückervariante auswählen","select handle variant","Variantes poignée ","Variante maniglia","Deurkruk variant","Vælg håndtagsvarianter","Välj handtagsvariant",null,null,null,4]
["Kundennummer","Customer No.","Numéro de client","Cliente numero","Klantnr.","Kundenummer","Kundnummer",null,null,null,5]
["Kundenname","Customer Name","Nom du client","Nome cliente","Klant naam","Kundenavn","Kundnamn",null,null,null,6]
["Projekt-Nr.  ","Project No.","Numéro de projet","Progetto numero","Projectnr.","Projekt-nr.  ","Projektnr  ",null,null,null,7]
["Projekt-Name  ","Project Name","Nom du projet","Nome progetto","Project naam","Projekt-navn  ","Projektnamn  ",null,null,null,8]
["Anlage zu Bestellnummer  ","Attachment to Order No.","Pièce(s) jointe(s) à la commande","Allegato all'ordine","Bijlage bij ordernr.","Bilag til bestilling  ","Bilaga till beställningsnummer  ",null,null,null,9]
["Anzahl","Quantity","Quantité","Quantità","Aantal","Antal","Antal",null,null,null,10]
["Produktname","product name","Nom du produit","Nome prodotto","Productnaam","Produktnavn","Produktnamn",null,null,null,11]
["Profil","Profile","Profil","Codice del profilo","Profiel","Profil","Profil",null,null,null,12]
["SmartHandle Version","SmartHandle Version","Version de la SmartHandle","Versione SmartHandle","SmartHandle versie","SmartHandle version","SmartHandle-version",null,null,null,13]
["Außenrosette","rosette on the outside","Rosace extérieure","Rondella esterna","Buitenrozet","Udvendig roset","Täckbricka utsida",null,{"$f":"HLOOKUP($I$3,$A$234:$G$282,14,FALSE)","v":"Udvendig roset"},null,14]
["Türdicke (mm)","Door Thickness (mm)","Epaisseur de porte (mm)","Spessore porta (mm)","Deurdikte (mm)","Dørtykkelse (mm)","Dörrtjocklek (mm)",null,null,null,15]
["Vierkant (mm)","Spindle Square (mm)","Carré (mm)","Quadro maniglia (mm)","Vierkant stift (mm)","Firkant (mm)","Fyrkant (mm)",null,null,null,16]
["Entfernung","Centre Distance","Distance","Interasse","H.O.H. maat","Afstand","Avstånd",null,null,null,17]
["Version","Version","Version","Versione","Versie","Version","Version",null,null,null,18]
["Drücker außen","Handle Variants Outside","Variantes de la béquille extérieure","Maniglia esterna","Deurkruk type Buiten","Udvendigt håndtag","Handtag utsida",null,null,null,19]
["Drücker innen","Handle Variants Inside","Variantes de la béquille intérieure","Maniglia interna","Deurkruk type Binnen","Indvendigt håndtag","Handtag insida",null,null,null,20]
["Oberfläche","Surface Finish","Finition de la surface:","Superficie","Afwerking","Overflade","Yta",null,null,null,21]
["Lesetechnik","Reading Technology","Technique de lecture","Tecnologia di lettura","Leestechniek","Læseteknik","Lästeknik",null,null,null,22]
["Optionen","Options","Options","Opzioni","Opties","Optioner","Alternativ",null,null,null,23]
["kpl. Artikelnummer","Complete Part Number","Code article complet","Numero articolo completo","Complete onderdeel nummer","Kompl. varenummer","Kompl. artikelnummer",null,null,null,24]
["Artikelnummer korrekt?","part numer correct?","Code article correct?","Numero articolo giusto?","onderdeel nummer juist?","Korrekt varenummer?","Är artikelnumret riktigt?",null,null,null,25,null,null," "]
[" (*) Zusatz-\nInformation"," (*) additional\ninformation","(*) informations\ncomplémentaires "," (*) Informazioni\naggiuntive","(*) Extra\ninformatie ","(*) Yderlige informationer ","(*) Extra\ninformation ",null,{"$f":"HLOOKUP($I$3,$A$234:$G$282,26,FALSE)","v":"(*) Yderlige informationer "},null,26]
["(A0) - Europrofil\n- stehende Montage","(A0) Europrofile\n- upright mounting","(A0) - profil européen\n- montage debout","(A0) - Profilo europeo montaggio verso l'alto",{"$f":"\"(A0) - Europrofiel\"&CHAR(10)&\"staande montage\"","v":"(A0) - Europrofiel\nstaande montage"},"(A0) - Europrofil\n- stående Montage","(A0) - Europrofil\n- stående montering",null,{"$f":"HLOOKUP($I$3,A234:G283,27,FALSE)","v":"(A0) - Europrofil\n- stående Montage"},null,27]
[null,null,null,null,null,null,null,null,null,null,28]
["British Oval ohne Lochung für Profilzylinder","British Oval without MO","ovale britannique sans VM (SHA) (*)","British Oval senza MO (SHA) (*)","British Oval zonder MO (SHA) (*)","Britisk Oval uden udstansning til profilcylinder","British Oval utan hål för profilcylinder",null,null,null,29]
["Europrofil mit Lochung für Profilzylinder MO (SHC) ","Europrofile with MO","profil européen avec VM (SHC)","profilo europeo con MO (SHC)","Euro profiel met MO (SHC)","Europrofil med udstansning til profilcylinder MO (SHC) ","Europrofil med hål för profilcylinder MO (SHC) ",null,null,null,30]
["Swiss Round mit Lochung für Profilzylinder MO","Swiss Round with MO","profil suisse avec VM (SHD)","Swiss Round con MO (SHD)","Swiss Round met MO (SHD)","Swiss Round med udstansning til profilcylinder MO","Swiss Round med hål för profilcylinder MO",null,null,null,31]
["Scandinavian Oval mit Lochung für Profilzylinder MO (SHE)","Scandinavian Oval with MO","Ovale scandinave avec VM (SHE)","Scandinavian Oval con MO (SHE)","Scandinavian Oval met MO (SHE)","Skandinavisk Oval med udstansning til profilcylinder MO (SHE)","Scandinavian Oval med hål för profilcylinder MO (SHE)",null,null,null,32]
["Schliessen","Close","Fermer","Chuidi","Sluiten","Afslut","Avsluta",null,{"$f":"HLOOKUP($I$3,A234:G282,33,FALSE)","v":"Afslut"},null,33]
["(A3) - Europrofil\n- stehende Montage für Rohrramen","(A3) - Europrofile - upright mounting for tubular frame doors","(A3) - Europrofile - montage vertical pour portes à cadre tubulaire","(A3) - Europrofile - montaggio verticale per porte con telaio tubolare","(A3) - Europrofiel - staanderbevestiging voor deuren met buisframe","(A3) - Europrofile - opretstående montering til rørformede døre","(A3) - Europrofile - upprätt montering för rörformiga ramdörrar",null,{"$f":"HLOOKUP($I$3,A234:G284,34,FALSE)","v":"(A3) - Europrofile - opretstående montering til rørformede døre"},null,34]
["mit","with","avec","con","met","med ","med",null,{"$f":"HLOOKUP($I$3,A234:G285,35,FALSE)","v":"med "},null,35]
[null,null,null,null,null,null,null,null,null,null,36]
[null,null,null,null,null,null,null,null,null,null,37]
[null,null,null,null,null,null,null,null,null,null,38]
[null,null,null,null,null,null,null,null,null,null,39]
[null,null,null,null,null,null,null,null,null,null,40]
[null,null,null,null,null,null,null,null,null,null,41]
[null,null,null,null,null,null,null,null,null,null,42]
["Swiss Round","Swiss Round","Profil suisse","Swiss Round","Swiss Round","Swiss Round","Swiss Round",null,null,null,43]
[null,null,null,null,null,null,null,null,null,null,44]
[null,null,null,null,null,null,null,null,null,null,45]
["Î","P",null,null,null,null,null,null,null,null,46]
["zur Ansicht des SmartHandles bitte die gelb markierten Felder aus dem Drop-Down Menü auswählen","to view the SmartHandle please select the yellow marked fields from the dropdown menu","Pour l'aperçu de la SmartHandle, veuillez sélectionner les champs jaunes du Menu déroulant","per visualizzare la SmartHandle selezionare i campi marcati in giallo nel menu a discesa","voor een weergave van de SmartHandle kunt u de geel gemarkeerde velden uit het dropdown-menu selecteren","for at se SmartHandle vælges de med gult markerede felter i drop-down menuen","välj de gulmarkerade fälten i rullmenyn för att titta på SmartHandle",null,null,null,47]
["Beschreibung","Description","Description","descrizione","Beschrijving","Beskrivelse","Beskrivning",null,null,null,48]
["Zusammenfassung der Bestellung","order summary","Résumé de la commande","Riepilogo ordine","Samenvatting van de bestelling","Resumé af bestillingen","Sammanfattning av beställningen",null,{"$f":"HLOOKUP($I$3,A234:G282,49,FALSE)","v":"Resumé af bestillingen"},null,49]
["zurück zur Hauptseite","back to main page","Retour à la page d’accueil","Torna alla pagina principale","terug naar de startpagina ","tilbage til forsiden","tillbaka till huvudsidan",null,{"$f":"HLOOKUP($I$3,A234:G283,50,FALSE)","v":"tilbage til forsiden"},null,50]
["Bemerkungen","Comments","Remarque","Note","Beperkingen","Bemærkninger","Anmärkningar",null,{"$f":"HLOOKUP($I$3,A234:G284,51,FALSE)","v":"Bemærkninger"},null,51]
["zur Zusammenfassung","go to summary","Accéder au résumé","vai al riepilogo","naar de samenvatting","til resumé","till sammanfattningen",null,{"$f":"HLOOKUP($I$3,A234:G285,52,FALSE)","v":"til resumé"},null,52]
[", mit ZK",", with ZK",", avec ZK",", con ZK",", met ZK",", med ZK",", med tillträdeskontroll",null,{"$f":"HLOOKUP($I$3,$A$234:$G$286,53,FALSE)","v":", med ZK"},null,53]
["ohne Drücker","without lever handle","Sans béquille","senza leva","zonder hendelgreep","uden håndtag","utan handtag",null,null,null,54]
["ohne Drücker (für Fremddrücker vorbereitet)","without lever handle (prepared for 3rd party lever)","Sans béquille (prévu pour béquille étrangères)","senza leva (predisposta per leve di altri fornitori)","zonder hendelgreep (voorbereid voor hendel van derden)","uden håndtag (forberedt for fremmed håndtag)","utan handtag (förberett för annat handtag)",null,null,null,55]
["Bitte verwenden Sie zum Drucken den Druckbutton in der Bestell-Zusammenfassung\n\nMöchten Sie zur Bestell-Zusammenfassung weitergeleitet werden?","To print the order, please use the print button in the order summary\n\nWould you like to be forwarded to the order summary?","Pour imprimer, veuillez utiliser le bouton « Imprimer » disponible sur le résumé de la commande\n\nSouhaitez-vous accéder au résumé de la commande ?","Per effettuare una stampa, utilizzare il pulsante all’interno del riepilogo ordine\n\nDesidera ritornare al riepilogo ordine?","Gebruik voor het uitprinten de printbutton in de samenvatting van de bestelling\n\nWilt u doorgaan naar de samenvatting van de bestelling?","For at printe, klik på printerknappen i bestillingsresuméet\n\nFortsætte til bestillingsresuméet?","Använd utskriftsknappen i beställningssammanfattningen för att skriva ut\n\nVill du komma till beställningssammanfattningen?",null,{"$f":"HLOOKUP($I$3,A234:G289,56,FALSE)","v":"For at printe, klik på printerknappen i bestillingsresuméet\n\nFortsætte til bestillingsresuméet?"},null,56]
["Profilname","Lock Type","Type de profil","Tipo di profilo","Sluiting type","Profilnavn","Profilnamn",null,null,null,57]
["Innenrosette","rosette on the intside","Rosace intérieure","Rondella interna","Binnenrozet","Indvendig roset","Täckbricka insida",null,{"$f":"HLOOKUP($I$3,$A$234:$G$348,58,FALSE)","v":"Indvendig roset"},null,58]
["Montageform","mounting type","Forme de montage","Forma","Montagevorm","Montageform","Monteringsform",null,{"$f":"HLOOKUP($I$3,$A$234:$G$348,59,FALSE)","v":"Montageform"},null,59]
[null,null,null,null,null,null,null,null,null,null,60]
["Befestigung","Fixing / Back Plate Width","Fixation / largeur de plaque","Fissaggio","Bevestiging/ Grondplaat breed","Fastgørelse","Montering",null,null,null,61]
["ohne Rosette","without rosette","Sans Rosace","senza rondella","zonder rozet ","uden roset","utan täckbricka",null,{"$f":"HLOOKUP($I$3,$A$234:$G$348,62,FALSE)","v":"uden roset"},null,62]
["ohne Schließzylinder-Öffnung","without recess for cylinder","Sans ouverture de cylindre de fermeture","senza apertura cilindro","zonder cilinderopening  ","uden låsecylinder-åbning","utan öppning för låscylinder",null,{"$f":"HLOOKUP($I$3,$A$234:$G$348,63,FALSE)","v":"uden låsecylinder-åbning"},null,63]
["mit Schließzylinder-Öffnung","with recess for cylinder","Avec ouverture de cylindre de fermeture","con apertura cilindro","met cilinderopening","med låsecylinder-åbning","med öppning för låscylinder",null,{"$f":"HLOOKUP($I$3,$A$234:$G$348,64,FALSE)","v":"med låsecylinder-åbning"},null,64]
["stehende Montage","upright mounting","montage debout","montaggio verso l’alto","staande montage","stående montage","stående montering",null,{"$f":"HLOOKUP($I$3,$A$234:$G$348,65,FALSE)","v":"stående montage"},null,65]
["(A1) - Europrofil\n- hängende Montage [70-79 mm]","(A1) - Europrofile\n- upside down mounting [70-79 mm]","(A1) - profil européen\n- montage suspendu [70-79 mm]","(A1) - Profilo Europeo - Montaggio verso il basso  [70-79 mm]","(A1) - Europrofiel\n- hangende montage [70-79 mm]","(A1) - Europrofil\n- hængende Montage [70-79 mm]","(A1) - Europrofil\n- hängande montering [70-79 mm]",null,{"$f":"HLOOKUP($I$3,$A$234:$G$348,66,FALSE)","v":"(A1) - Europrofil\n- hængende Montage [70-79 mm]"},null,66]
["(A2) - Europrofil\n- hängende Montage [70-110 mm]","(A2) - Europrofile\n- upside down mounting [70-110 mm]","(A2) - profil européen\n- montage suspendu [70-110 mm]","(A2) - Profilo Europeo - Montaggio verso il basso  [70-110 mm]","(A2) - Europrofiel\n- hangende Montage [70-110 mm]","(A2) - Europrofil\n- hængende Montage [70-110 mm]","(A2) - Europrofil\n- hängande montering [70-110 mm]",null,{"$f":"HLOOKUP($I$3,$A$234:$G$348,67,FALSE)","v":"(A2) - Europrofil\n- hængende Montage [70-110 mm]"},null,67]
["G1/G2","G1/G2","G1 / G2","G1/G2","G1/G2","G1/ G2","G1/G2",null,null,null,68]
["(E0) - Scandinavian Oval\n- ohne Schließzylinder-Öffnung / stehende Montage","(E0) - Scandinavian Oval\n- without recess for cylinder / upright mounting","(E0) - Ovale scandinave\n- sans ouverture de cylindre de fermeture / montage debout","(E0) - Profilo Scandinavo - senza apertura cilindro / montaggio verso l'alto","(E0) - Scandinavian Oval\n- zonder cilinderopening / staande montage","(E0) - Skandinavisk Oval\n- uden låsecylinderåbning / stående montage","(E0) - Scandinavian Oval\n- utan hål för låscylinder/stående montering",null,{"$f":"HLOOKUP($I$3,$A$234:$G$348,69,FALSE)","v":"(E0) - Skandinavisk Oval\n- uden låsecylinderåbning / stående montage"},null,69]
["(E1) - Scandinavian Oval\n- mit Schließzylinder-Öffnung / stehende Montage","(E1) - Scandinavian Oval\n- with recess for cylinder / upright mounting","(E1) - Ovale scandinave\n- avec ouverture de cylindre de fermeture / montage debout","(E1) - Profilo Scandinavo - con apertura cilindro / montaggio verso l'alto","(E1) - Scandinavian Oval\n- met cilinderopening / staande montage","(E1) - Skandinavisk Oval\n- med låsecylinderåbning  / stående montage","(E1) - Scandinavian Oval\n- med hål för låscylinder/stående montering",null,{"$f":"HLOOKUP($I$3,$A$234:$G$348,70,FALSE)","v":"(E1) - Skandinavisk Oval\n- med låsecylinderåbning  / stående montage"},null,70]
["L-Form rund (A)","L-shape curved (A)","forme en L arrondie (A)","Forma a L tondeggiante (A)","L-vorm rond gebogen (A)","L-form rund (A )","L-form rund (A)",null,{"$f":"HLOOKUP($I$3,$A$234:$G$348,71,FALSE)","v":"L-form rund (A )"},null,71]
["L-Form Gehrung (B)","L-shape mitre (B)","forme en L rectangulaire (B)","Forma a L ad angolo retto (B)","L-vorm verstek (B)","L-form  gering (B)","L-form gering (B)",null,{"$f":"HLOOKUP($I$3,$A$234:$G$348,72,FALSE)","v":"L-form  gering (B)"},null,72]
["U-Form rund (C)","U-shape curved (C)","forme en U arrondie (C)","Forma a U tondeggiante (C)","U-vorm rond gebogen (C)","U-form rund (C)","U-form rund (C)",null,{"$f":"HLOOKUP($I$3,$A$234:$G$348,73,FALSE)","v":"U-form rund (C)"},null,73]
["U-Form Gehrung (D)","U-shape mitre (D)","forme en U rectangulaire (D)","Forma a U ad angolo retto D)","U-vorm verstek (D)","U-form  gering (D)","U-form gering (D)",null,{"$f":"HLOOKUP($I$3,$A$234:$G$348,74,FALSE)","v":"U-form  gering (D)"},null,74]
["Ohne Drücker (0)","without handle (0)","Sans béquille (0)","Senza leva (0)","Zonder deurkruk (0)","Uden håndtag (O)","Utan handtag (0)",null,{"$f":"HLOOKUP($I$3,$A$234:$G$348,75,FALSE)","v":"Uden håndtag (O)"},null,75]
[", zugelassen für FH-Türen",", approved for fire-resistant doors",", homologué pour portes FH",", omologato per porte FH",", toegelaten voor FH-deuren",", godkendt til branddøre",", tillåten för brandskyddsdörrar",null,{"$f":"HLOOKUP($I$3,$A$234:$G$348,76,FALSE)","v":", godkendt til branddøre"},null,76]
["Europrofil / Swiss Round","Europrofile / Swiss Round","Profil européen / Profil suisse","profilo europeo / Swiss Round","Euro profiel / Swiss Round","Europrofil / Swiss Round","Europrofil / Swiss Round",null,{"$f":"HLOOKUP($I$3,$A$234:$G$348,77,FALSE)","v":"Europrofil / Swiss Round"},null,77]
["silber / schwarzgrau","silver / black grey","argent /  gris noir","argento / grigio nerastro","zilverkleurig / zwartgrijs","sølv / sort grå","silver / svart grå",null,{"$f":"HLOOKUP($I$3,$A$234:$G$348,78,FALSE)","v":"sølv / sort grå"},null,78]
["silber / weiß","silver / white","argent / blanc","argento / bianco","zilverkleurig / wit ","sølv / hvid","silver / vit",null,{"$f":"HLOOKUP($I$3,$A$234:$G$348,79,FALSE)","v":"sølv / hvid"},null,79]
["Aktiv (A)","active (A)","Actif (A)","Attivo (A)","Actief (A)","Aktiv (A)","Aktiv (A)",null,{"$f":"HLOOKUP($I$3,$A$234:$G$348,80,FALSE)","v":"Aktiv (A)"},null,80]
["(M) SmartCards / SmartTags","(M) SmartCards / SmartTags","(M) SmartCards / SmartTags","(M) SmartCards / SmartTags","(M) SmartCards / SmartTags","(M) SmartCards / SmartTags","(M) SmartCards / SmartTags",null,{"$f":"HLOOKUP($I$3,$A$234:$G$348,81,FALSE)","v":"(M) SmartCards / SmartTags"},null,81]
["Hybrid (AM)","hybride (AM)","Hybrid (AM)","Hybrid (AM)","Hybride (AM)","Hybrid (AM)","Hybrid (AM)",null,{"$f":"HLOOKUP($I$3,$A$234:$G$348,82,FALSE)","v":"Hybrid (AM)"},null,82]
["(0) dauereingekuppelt / ohne Elektronik","(0) engaged / without electronics","(0) embrayé / sans électronique","(0) In presa/senza elettronica","(0) gekoppeld / zonder electronica","(0) Uden elektronik","(0) Permanent förlovad / utan elektronik",null,{"$f":"HLOOKUP($I$3,$A$234:$G$348,83,FALSE)","v":"(0) Uden elektronik"},null,83]
["U-Form rund und gekröpft (L)","U-shape curved and cranked (L)","Forme en U courbée et coudée (L)","Forma a U curva e a gomito (L)","U-vormig gebogen en gezwenkt (L)","U-form buet og drejet (L)","U-form böjd och vevlad (L)",null,{"$f":"HLOOKUP($I$3,$A$234:$G$348,84,FALSE)","v":"U-form buet og drejet (L)"},null,84]
[" (**) Zusatz-\nInformation"," (**) additional\ninformation","(**) informations\ncomplémentaires "," (**) Informazioni\naggiuntive","(**) Extra\ninformatie ","(**) Yderlige informationer ","(**) Extra\ninformation ",null,{"$f":"HLOOKUP($I$3,$A$234:$G$348,85,FALSE)","v":"(**) Yderlige informationer "},null,85]
[null,null,null,null,null,null,null,null,null,null,86]
["Download Bestellhilfe (Händlerbereich)","Download of the ordering guide (Value Added Resellers)","Téléchargement Guide de commande (Revendeurs)","Scaricamento del Guida all'ordinazione di Smart Handle (Rivenditori)","Download Bestelhulp Digitale SmartHandle (Handelaars)","Download hjælp til bestilling (forhandlersektionen)","Ladda ned beställningsguiden (återförsäljararean)",null,null,null,87]
[null,null,null,null,null,null,null,null,null,null,88]
["zum Produkt: Smart Handle aktiv","about the product: Smart Handle active","voir le produit: Smart Handle active","vai al prodotto Smart Handle attiva","product bekijken: Smart Handle actieve","til produktet: Smart Handle aktiv","till produkten: SmartHandle aktiv",null,null,null,89]
["zum Produkt: Smart Handle passiv","about the product: Smart Handle passive","voir le produit: Smart Handle passive","vai al prodotto Smart Handle passiva","product bekijken: Smart Handle passieve","til produktet: Smart Handle passiv","till produkten: SmartHandle passiv",null,null,null,90]
["(*) Bitte beachten Sie, dass je British Oval SmartHandle ein Adapter „SH.BO.ADAPT“ separat bestellt werden muss.","(*) Please note that adapter \"SH.BO.ADAPT\" must be ordered separately for each British Oval SmartHandle.","(*) Veuillez S.V.P. observer que par SmartHandle du type „ British Oval“, il est nécessaire de commander séparément un adaptateur « SH.BO.ADAPT ».","(*) Si informa che per ogni maniglia con profilo ovale britannico è anche necessario ordinare separatamente un adattatore “SH.BO.ADAPT”.","(*) Let op, bij een Britsh Oval SmartHandle moet een „SH.BO.ADAPT“ apart besteld worden.","(*) bemærk at man skal bestille en adapter „SH.BO.ADAPT“  separat til alle Britisk Oval SmartHandles.","(*) Observera att en adapter SH.BO.ADAPT måste beställas separat till varje British Oval SmartHandle.",null,null,null,91]
["Bemerkungen","Comments","Remarque","Note","Beperkingen","Bemærkninger","Anmärkningar",null,null,null,92]
["http://www.simons-voss.com/Haendler-Bereich.14.0.html?&no_cache=1&L=0","http://www.simons-voss.com/Haendler-Bereich.14.0.html?&no_cache=1&L=1&no_cache=1","http://www.simons-voss.com/Value-Added-Resellers.14.0.html?&no_cache=1&L=2&no_cache=1","http://www.simons-voss.com/REVENDEURS.14.0.html?&no_cache=1&L=4&no_cache=1","http://www.simons-voss.com/RIVENDITORI.14.0.html?&no_cache=1&L=3&no_cache=1","http://www.simons-voss.com/Haendler-Bereich.14.0.html?&no_cache=1&L=0","http://www.simons-voss.com/Haendler-Bereich.14.0.html?&no_cache=1&L=0",null,null,null,93]
["http://www.simons-voss.com/Smart-Handles.825.0.html?&L=0","http://www.simons-voss.com/SmartHandle.825.0.html?&L=1&amp%3BL=0%20%3C","http://www.simons-voss.com/Smart-Handles.825.0.html?&L=2","http://www.simons-voss.com/Smart-Handles.825.0.html?&L=4&id=825","http://www.simons-voss.de/Smart-Handles.825.0.html?&L=3","http://www.simons-voss.com/Smart-Handles.825.0.html?&L=0","http://www.simons-voss.com/Smart-Handles.825.0.html?&L=0",null,null,null,94]
["http://www.simons-voss.com/Smart-Handles-Hybrid.1350.0.html?&L=0","http://www.simons-voss.com/Smart-Handles-Hybrid.1350.0.html?&L=1","http://www.simons-voss.com/Smart-Handles-Hybrid.1350.0.html?&L=2&amp=","http://www.simons-voss.com/Smart-Handles-Hybride.1350.0.html?&L=4","http://www.simons-voss.com/Smart-Handle-Hybrid.1350.0.html?&L=3&amp=","http://www.simons-voss.com/Smart-Handles-Hybrid.1350.0.html?&L=0","http://www.simons-voss.com/Smart-Handles-Hybrid.1350.0.html?&L=0",null,null,null,95]
["Scandinavian Oval","Scandinavian Oval","Ovale scandinave","Scandinavian Oval","Scandinavian Oval","Skandinavisk Oval","Scandinavian Oval",null,null,null,96]
["Standard SmartHandle (ohne Door Monitoring)","Standard SmartHandle (without Door Monitoring)","SmartHandle standard (sans Door Monitoring)","SmartHandle standard (Senza DoorMonitoring)","Standaard SmartHandle (zonder deurstand signalering)","Standard SmartHandle (uden dørmonitorering)","Standard SmartHandle (utan dörrövervakning)",null,null,null,97]
["Door Monitoring (interne Sensorik)","Door Monitoring  (internal sensors)","Door Monitoring (capteurs internes)","Door Monitoring (sensore interno)","Deurstand signalering (interne sensors)","Dørmonitorering (intern transducer)","Dörrövervakning (intern givare)",null,null,null,98]
["Door Monitoring (externe Sensorik)","Door Monitoring (external sensors)","Door Monitoring (capteurs externes)","Door Monitoring (sensore esterno)","Deurstand signalering (externe sensors)","Dørmonitorering (håndtagstransducer)","Dörrövervakning (extern givare)",null,null,null,99]
["Door Monitoring (Drückersensorik)","Door Monitoring (handle sensor)","Door monitoring (capteur poignée)","Door Monitoring (sensore sulla leva)","Deurstand signalering (kruk sensor)","Dørmonitorering (håndtagstransducer)","Dörrövervakning (handtagsgivare)",null,null,null,100]
["SmartHandle Typ","type of SmartHandle","type de SmartHandle","Tipo di SmartHandle","SmartHandle uitvoering","SmartHandle Type","SmartHandle-typ",null,null,null,101]
[null,null,null,null,null,null,null,null,null,null,102]
["Î","P",null,null,null,null,null,null,null,null,103]
["siehe Bemerkung unten","see comment below","voir remarques ci-après","Vedere i commenti in calce","Zie onderstaande opmerking","se bemærkning nedenfor","se anmärkningar nedan",null,null,null,104]
["ACHTUNG bei Bestellungen von Door Monitoring SmartHandles mit interner oder externer Sensorik: \nDas WaveNet LockNode ist fest integriert und kann nicht gewechselt werden!","IMPORTANT – when placing orders for DoorMonitoring SmartHandles with internal or external sensors:\nThe WaveNet LockNode is permanently integrated and cannot be changed.","Please note for orders with internal or external sensors:\nThe Lock Node is already included and cannot be changed.","Please note for orders with internal or external sensors:\nThe Lock Node is already included and cannot be changed.","Please note for orders with internal or external sensors:\nThe Lock Node is already included and cannot be changed.","BEMÆRK ved bestillinger af dørmonitorering SmartHandles med intern eller ekstern transducer: \nWaveNet LockNode er fast integreret og kan ikke udskiftes!","Obs! Vid beställning av SmartHandle med dörrövervakning och intern eller extern givare: \nWaveNet LockNode är fast inbyggd och kan inte bytas ut!",null,null,null,105]
["Plattensystem mit MO ","plate system w. MO ",null,null,null,"Pladesystem med MO ","Plattsystem med mekanisk överbryggning ",null,null,null,106]
["nicht verfügbar","not available","Non disponible","non disponibile","niet beschikbaar ","fås ikke","finns inte",null,null,{"$f":"HLOOKUP($I$3,$A$234:$G$358,107,FALSE)","v":"fås ikke"},107]
["nicht benötigt","not required","Pas nécessaire","non necessario","niet nodig ","kræves ikke","behövs inte",null,null,{"$f":"HLOOKUP($I$3,$A$234:$G$358,108,FALSE)","v":"kræves ikke"},108]
["Mindestens eine der angegebenen Artikelnummern ist nicht korrekt.\n\nBitte korrigieren.","At least one of the selected item numbers is not correct.\n\nPlease correct your input.","Au moins un des numéros d’articles saisis est incorrect.\n\nVeuillez corriger.","Almeno uno dei codici articolo indicati è errato.\n\nCorreggere.","Minstens een van de vermelde artikelnummers is niet correct.\n\nCorrigeer dit alstublieft.","Mindst et af de anførte varenumre er ikke korrekt.\n\nKorriger det venligst.","Minst ett av de angivna artikelnumren är felaktigt.\n\nVar vänlig rätta till.",null,null,{"$f":"HLOOKUP($I$3,$A$234:$G$358,109,FALSE)","v":"Mindst et af de anførte varenumre er ikke korrekt.\n\nKorriger det venligst."},109]
["Bitte nutzen Sie in den Artikelzeilen ausschließlich die angebotene Drop Down Liste","Please ensure that all entries are selected from the drop down menu","Pour les lignes relatives aux articles, n´utilisez que la liste Drop down/ la liste proposée.","Selezionare il codice prodotto da inserire nell' apposito spazio, scegliendolo dalla lista del dropdown.","Gebruik bij de artikel regels uitsluitend de aangeboden keuzelijst.","Brug kun den viste drop-down-liste i produktlinjerne ","Använd bara de rullistor som finns i artikelraderna",null,null,{"$f":"HLOOKUP($I$3,$A$234:$G$358,110,FALSE)","v":"Brug kun den viste drop-down-liste i produktlinjerne "},110]
["SmartHandle AX (Smart Intego)","SmartHandle AX (Smart Intego)","SmartHandle AX (Smart Intego)","SmartHandle AX (Smart Intego)","SmartHandle AX (Smart Intego)","SmartHandle AX (Smart Intego)","SmartHandle AX (Smart Intego)",null,null,{"$f":"HLOOKUP($I$3,$A$234:$G$358,111,FALSE)","v":"SmartHandle AX (Smart Intego)"},111]
["SmartHandle AX (Mobile Key)","SmartHandle AX (Mobile Key)","SmartHandle AX (Mobile Key)","SmartHandle AX (Mobile Key)","SmartHandle AX (Mobile Key)","SmartHandle AX (Mobile Key)","SmartHandle AX (Mobile Key)",null,null,{"$f":"HLOOKUP($I$3,$A$234:$G$358,112,FALSE)","v":"SmartHandle AX (Mobile Key)"},112]
["Smart Intego","Smart Intego","Smart Intego","Smart Intego","Smart Intego","Smart Intego","Smart Intego",null,null,{"$f":"HLOOKUP($I$3,$A$234:$G$358,113,FALSE)","v":"Smart Intego"},113]
["Mobile Key","Mobile Key","Mobile Key","Mobile Key","Mobile Key","Mobile Key","Mobile Key",null,null,{"$f":"HLOOKUP($I$3,$A$234:$G$358,114,FALSE)","v":"Mobile Key"},114]
["(B0) - Swiss Round\n- stehende Montage","(B0) - Swiss Round\n- upright mounting","(B0) - Rond suisse\n- Montage debout","(B0) - Profilo Swiss Round - montaggio verso l'alto","(B0) - Swiss Round\n- staande montage","(B0) - Swiss Round\n- stående montage","(B0) - Swiss Round\n- stående montering",null,null,{"$f":"HLOOKUP($I$3,$A$234:$G$358,115,FALSE)","v":"(B0) - Swiss Round\n- stående montage"},115]
["(B1) - Swiss Round\n- hängende Montage [70-79 mm]","(B1) - Swiss Round\n- upside down mounting [70-79 mm]","(B1) - Rond suisse\n- Montage debout [70-79 mm]","(B1) - Profilo Swiss Round - montaggio verso il basso [70-79 mm]","(B1) - Swiss Round\n- hangende montage [70-79 mm]","(B1) - Swiss Round\n- hængende montage [70-79 mm]","(B1) - Swiss Round\n- hängande montering [70-79 mm]",null,null,{"$f":"HLOOKUP($I$3,$A$234:$G$358,116,FALSE)","v":"(B1) - Swiss Round\n- hængende montage [70-79 mm]"},116]
["(B2) - Swiss Round\n- hängende Montage [70-110 mm]","(B2) - Swiss Round\n- upside down mounting [70-110 mm]","(B2) - Rond suisse\n- Montage debout [70-110 mm]","(B2) - Profilo Swiss Round - montaggio verso il basso [70-110 mm]","(B2) - Swiss Round\n- hangende montage [70-110 mm]","(B2) - Swiss Round\n- hængende Montage [70-110 mm]","(B2) - Swiss Round\n- hängande montering [70-110 mm]",null,null,{"$f":"HLOOKUP($I$3,$A$234:$G$358,117,FALSE)","v":"(B2) - Swiss Round\n- hængende Montage [70-110 mm]"},117]
["Außenseite","outside","Côté extérieur","Lato esterno","Buitenzijde","Yderside","Utsida",null,null,{"$f":"HLOOKUP($I$3,$A$234:$G$358,118,FALSE)","v":"Yderside"},118]
["Innenseite","inside","Côté intérieur","Lato interno","Binnenzijde","Inderside","Insida",null,null,{"$f":"HLOOKUP($I$3,$A$234:$G$358,119,FALSE)","v":"Inderside"},119]
["[ (A1) Entfernung 70-79 mm ]","[ (A1) distance 70-79 mm ]","[ (A1) Distance 70-79 mm ]","[ (A1) Interasse 70-79 mm ]","[ (A1) Afstand 70-79 mm ]","[ (A1) Afstand 70-79 mm ]","[ (A1) Avstånd 70-79 mm ]",null,{"$f":"HLOOKUP($I$3,$A$234:$G$354,120,FALSE)","v":"[ (A1) Afstand 70-79 mm ]"},null,120]
["[ (A2) Entfernung 70-110 mm ]","[ (A2) distance 70-110 mm ]","[ (A2) Distance 70-110 mm ]","[ (A2) Interasse 70-110 mm ]","[ (A2) Afstand 70-110 mm ]","[ (A2) Afstand 70-110 mm ]","[ (A2) Avstånd 70-110 mm ]",null,{"$f":"HLOOKUP($I$3,$A$234:$G$354,121,FALSE)","v":"[ (A2) Afstand 70-110 mm ]"},null,121]
["Entfernungsmaß 70-79 mm","distance 70-79 mm","Écart 70-79 mm","Misura interasse 70-79 mm","Afstand 70-79 mm","Afstandsmål 70-79 mm","Räckvidd 70-79 mm",null,{"$f":"HLOOKUP($I$3,$A$234:$G$356,122,FALSE)","v":"Afstandsmål 70-79 mm"},null,122]
["Entfernungsmaß 70-110 mm","distance 70-110 mm","Écart 70-110 mm","Misura interasse 70-110 mm","Afstand 70-110 mm","Afstandsmål 70-110 mm","Räckvidd 70-110 mm",null,{"$f":"HLOOKUP($I$3,$A$234:$G$356,123,FALSE)","v":"Afstandsmål 70-110 mm"},null,123]
["Europrofil / Swiss Round\nstehende Montage","Euro profile / Swiss Round\nupright mounting","Profile européen / rond suisse\nMontage debout","Profilo europeo / Swiss Round, montaggio verso l'alto","Europrofiel / Swiss Round\nstaande montage","Europrofil / Swiss Round\nstående montage","Europrofil/Swiss Round\nstående montering",null,{"$f":"HLOOKUP($I$3,$A$234:$G$359,124,FALSE)","v":"Europrofil / Swiss Round\nstående montage"},null,124]
["Europrofil / Swiss Round, hängende Montage","Euro profile / Swiss Round, upside down mounting","Profil européen / rond suisse, montage debout","Profilo europeo / Swiss Round, montaggio verso il basso","Europrofiel / Swiss Round, hangende montage","Europrofil/ Swiss Round, hængende montage","Europrofil/Swiss Round, hängande montering",null,{"$f":"HLOOKUP($I$3,$A$234:$G$359,125,FALSE)","v":"Europrofil/ Swiss Round, hængende montage"},null,125]
["Scandinavian Oval\nmit Mechanical Override","Scandinavian Oval\nwith Mechanical Override","Ovale scandinave\navec verrouillage mécanique","Profilo Scandinavo con Mechanical Override","Scandinavian Oval\nmet Mechanical Override","Scandinavisk Oval\nmed Mechanical Override","Scandinavian Oval\nmed mekanisk överbryggning",null,{"$f":"HLOOKUP($I$3,$A$234:$G$359,126,FALSE)","v":"Scandinavisk Oval\nmed Mechanical Override"},null,126]
["Bemaßungen","dimensions","Dimensions","Misure","Afmetingen","Dimensioneringer","Mått",null,{"$f":"HLOOKUP($I$3,$A$234:$G$360,127,FALSE)","v":"Dimensioneringer"},null,127]
["(*) Bitte beachten Sie, dass für FSB- und GLUTZ-Drücker ein Adapter benötigt wird. Dieser kann unter folgender Artikelnummer bestellt werden:\nS2.Adapterset.FSB / S2.Adapterset.GLUTZ","(*) Please note that an adapter is required for FSB handles and GLUTZ handles. The part number for this adapter is as follows:\nS2.Adapterset.FSB / S2.Adapterset.GLUTZ","Veuillez noter qu'un adaptateur est nécessaire pour les poignées FSB et GLUTZ. Celui-ci peut être commandé sous le numéro d'article S2.Adapterset.FSB / S2.Adapterset.GLUTZ","(*) Si ricorda che è necessario un adattatore per maniglie FSB o GLUTZ. L'articolo per questo adattatore è: S2.Adapterset.FSB / S2.Adapterset.GLUTZ","(*) houd er rekening mee dat een adapter nodig is voor de montage van  FSB en GLUTZ deurkrukken. Het artikelnummer voor dit adapter set is: S2.Adapterset.FSB / S2.Adapterset.GLUTZ","Bemærk venligst at der skal anvendes en adapter til FSB- og  GLUTZ greb. Varenummer: S2.ADAPTERSET.FSB / S2.ADAPTERSET.GLUTZ","(*) Observera att en adapter krävs för FSB-handtag och GLUTZ-handtag.\nS2.Adapterset.FSB / S2.Adapterset.GLUTZ",null,{"$f":"HLOOKUP($I$3,$A$234:$G$361,128,FALSE)","v":"Bemærk venligst at der skal anvendes en adapter til FSB- og  GLUTZ greb. Varenummer: S2.ADAPTERSET.FSB / S2.ADAPTERSET.GLUTZ"},null,128]
["Messing / weiß","brass / white","laiton / blanc","ottone / bianco","messing / wit ","messing / hvid","mässing / vit",null,{"$f":"HLOOKUP($I$3,$A$234:$G$362,129,FALSE)","v":"messing / hvid"},null,129]
["Farbbeispiel - Cover","colour example  - cover plates","exemple de couleurs - capot","colore - cover","Kleur voorbeeld - afdek platen","Farve ","Färgexempel - Omslag",null,{"$f":"HLOOKUP($I$3,$A$234:$G$363,130,FALSE)","v":"Farve "},null,130]
["Möchten Sie die Adapter für FSB- und/oder GLUTZ-Drücker mitbestellen? \n\nWenn ja, geben Sie bitte die entsprechende Stückzahl an.","Would you like to order adapters for handles from FSB and/or GLUTZ?\n\nIf so, please enter the required quantity.","souhaitez-vous également commander des adaptateurs pour les poignées FSB et/ou GLUTZ ?\n\nSi oui, merci de préciser la quantité souhaitée.","Vuoi ordinare adattatori per maniglie FSB o GLUTZ? Se sì, per favore indica la quantità","Wilt u adapters voor FSB en of Glutz deurkrukken bestellen                                                                                                                  Vul dan de vereiste aantallen in.","Hvis der skal benyttes FSB- og eller GLUTZ greb skal der bestilles en adapter. Indtast venligst antal","Vill du beställa adaptrar för FSB och / eller GLUTZ pushers?\n\nOm ja, ange lämpligt antal stycken.",null,{"$f":"HLOOKUP($I$3,$A$234:$G$364,131,FALSE)","v":"Hvis der skal benyttes FSB- og eller GLUTZ greb skal der bestilles en adapter. Indtast venligst antal"},null,131]
["gewünschte\nStückzahl","quantity\nrequested","quantité souhaitée","quantità richiesta","gewenste stuks","Indtast antal","kvantitet\nbegärde",null,{"$f":"HLOOKUP($I$3,$A$234:$G$366,132,FALSE)","v":"Indtast antal"},null,132]
["bereits erfasste\nStückzahl","quantity already\nentered","quantité déjà saisie","quantità già inserita","al ingevoerde aantallen","Antal indtastet","kvantitet redan\ngick in i",null,{"$f":"HLOOKUP($I$3,$A$234:$G$367,133,FALSE)","v":"Antal indtastet"},null,133]
["Nein, danke","No, thanks","Non, merci","No, grazie","Nee dank u","Nej tak","Nej tack",null,{"$f":"HLOOKUP($I$3,$A$234:$G$367,134,FALSE)","v":"Nej tak"},null,134]
["Adapterset für die Montage eines FSB-Drückers","adapter set for mounting of a FSB-handle","Set d'adaptation pour le montage d'une poignée FSB","set adattatore per il montaggio di una maniglia FSB","adapter set voor de montage van een FSB deurkruk","Adaptersæt til montering af FSB greb","adapter för montering av ett FSB lever handle",null,{"$f":"HLOOKUP($I$3,$A$234:$G$368,135,FALSE)","v":"Adaptersæt til montering af FSB greb"},null,135]
["Adapterset für die Montage eines GLUTZ-Drückers","adapter set for mounting of a GLUTZ-handle","Set d'adaptation pour le montage d'une poignée GLUTZ","set adattatore per il montaggio di una maniglia GLUTZ","adapter set voor de montage van een GLUTZ deurkruk","Adaptersæt til montering af GLUTZ greb","adapter för montering av ett GLUTZ lever handle",null,{"$f":"HLOOKUP($I$3,$A$234:$G$369,136,FALSE)","v":"Adaptersæt til montering af GLUTZ greb"},null,136]
["Brandschutz / Fluchttüren / PAS24","Fire protection / Escape doors / PAS24","Protection contre l'incendie/issues de secours/PAS24","Porte tagliafuoco / porte di emergenza / PAS24","Branddeuren/nooduitgangen/PAS24","Brandbeskyttelse / Flugtdøre / PAS24","Brandskydd/nödutgångar/PAS24",null,{"$f":"HLOOKUP($I$3,$A$234:$G$370,137,FALSE)","v":"Brandbeskyttelse / Flugtdøre / PAS24"},null,137]
["ja","yes","oui","si","ja","ja","ja",null,{"$f":"HLOOKUP($I$3,$A$234:$G$372,138,FALSE)","v":"ja"},null,138]
["nein","no","non","no","nee","nej","nej",null,{"$f":"HLOOKUP($I$3,$A$234:$G$372,139,FALSE)","v":"nej"},null,139]
["Panikstangenbefestigung benötigt","Panic bar attachment required","Fixation d'une barre antipanique nécessaire","Fissaggio del maniglione antipanico necessario","Aanbrenging van paniekstang noodzakelijk","Montering af panikstang kræves","Panikstångsfäste krävs",null,{"$f":"HLOOKUP($I$3,$A$234:$G$373,140,FALSE)","v":"Montering af panikstang kræves"},null,140]
["Bitte wählen Sie die verwendete Panikstange aus dem Dropdown-Menu aus","Please select the panic bar you are using from the dropdown menu","Veuillez sélectionner la barre antipanique utilisée dans le menu déroulant","Si prega di selezionare il maniglione antipanico utilizzato dal menu a discesa","Kies de gebruikte paniekstang uit via het dropdownmenu","Vælg den anvendte panikstang i dropdown-menuen","Välj befintlig panikstång i listrutan.",null,{"$f":"HLOOKUP($I$3,$A$234:$G$374,141,FALSE)","v":"Vælg den anvendte panikstang i dropdown-menuen"},null,141]
["BKS Vollblatttür, ohne Schild, 92 mm","BKS full-leaf door, without sign, 92 mm","Porte pleine BKS, sans plaque, 92 mm","Porta a tutta anta BKS, senza placca, 92 mm","BKS massieve deur, zonder schild, 92 mm","BKS fuldt dørblad, uden skilt, 92 mm","BKS helt dörrblad, utan skylt, 92 mm",null,{"$f":"HLOOKUP($I$3,$A$234:$G$377,142,FALSE)","v":"BKS fuldt dørblad, uden skilt, 92 mm"},null,142]
["BKS Vollblatttür, ohne Schild, 72 mm","BKS full-leaf door, without sign, 72 mm","Porte pleine BKS, sans plaque, 72 mm","Porta a tutta anta BKS, senza placca, 72 mm","BKS massieve deur, zonder schild, 72 mm","BKS fuldt dørblad, uden skilt, 72 mm","BKS helt dörrblad, utan skylt, 72 mm",null,{"$f":"HLOOKUP($I$3,$A$234:$G$377,143,FALSE)","v":"BKS fuldt dørblad, uden skilt, 72 mm"},null,143]
["CISA Vollblatttür (immer mit Schild und 72 mm)","CISA full-leaf door (always with sign and 72 mm)","Porte pleine CISA (toujours avec plaque 72 mm)","Porta a tutta anta CISA (sempre con placca 72 mm)","CISA massieve deur (altijd met schild en 72 mm)","CISA fuldt dørblad (altid med skilt og 72 mm)","CISA helt dörrblad (alltid med skylt och 72 mm)",null,{"$f":"HLOOKUP($I$3,$A$234:$G$377,144,FALSE)","v":"CISA fuldt dørblad (altid med skilt og 72 mm)"},null,144]
["Panikstangenbefestigung nicht benötigt","Panic bar attachment not required","Fixation d'une barre antipanique non nécessaire","Fissaggio del maniglione antipanico non necessario","Geen aanbrenging van paniekstang noodzakelijk","Montering af panikstang kræves ikke","Panikstångsfäste krävs inte",null,{"$f":"HLOOKUP($I$3,$A$234:$G$378,145,FALSE)","v":"Montering af panikstang kræves ikke"},null,145]
["Auswahl übernehmen","Apply selection","Appliquer la sélection","Confermare la selezione","Selectie overnemen","Bekræft valg","Använd urval",null,{"$f":"HLOOKUP($I$3,$A$234:$G$379,146,FALSE)","v":"Bekræft valg"},null,146]
["(A4) - EuroPZ, stehende Montage für die Panikstangenadaption","EuroPZ, vertical assembly for panic bar adaptation - (A4)","EuroPZ, montage vertical pour adaptation de barre antipanique - (A4)","Cilindro profilo Europeo, montaggio verticale per l'adattamento del maniglione antipanico - (A4)","EuroPC, staande montage voor de aanpassing met de paniekstang – (A4)","EuroPZ, stående montage til panikstangsadaption - (A4)","Euro PZ, stående montering för panikstångsanpassning – (A4)",null,{"$f":"HLOOKUP($I$3,$A$234:$G$380,147,FALSE)","v":"EuroPZ, stående montage til panikstangsadaption - (A4)"},null,147]
["(**) Bitte beachten Sie, dass für die Montage der Panikstange eine spezielle Befestigungsschraube B-7850 von der Fa. BKS notwendig ist.\nDiese ist nicht im Lieferumfang enthalten. (zugelassen für FH Türen / DIN179 / 1125)","(**) Please note that a special fixing screw B-7850 from BKS is required for mounting the panic bar.\nThis is not included in the scope of delivery. (approved for fire retardant doors / DIN179 / 1125)","(**) Veuillez noter que le montage de la barre antipanique nécessite une vis de fixation spéciale B-7850 de la société BKS.\nCelle-ci n'est pas incluse dans la livraison. (homologation pour portes FH/DIN179/1125)","(**) Si prega di notare che per il montaggio del maniglione antipanico è necessaria una vite di fissaggio speciale B-7850 della ditta BKS.\nLa vite non è compresa nella fornitura. (omologata per porte FH / DIN179 / 1125)","(**) Houd er rekening mee dat voor de montage van de paniekstang een speciale bevestigingsschroef B-7850 van de firma BKS nodig is.\nDeze wordt niet meegeleverd. (Toegelaten voor FH-deuren / DIN179 / 1125)","(**) Bemærk, at montering af panikstangen kræver en speciel skrue B-7850 fra firmaet BKS. Den medfølger ikke. (godkendt til FH-døre / DIN179 / 1125)","(**) Observera att den särskilda fästskruven B-7850 från företaget BKS är nödvändig vid montering av panikstången.\nDen ingår inte i leveransen. (godkänd för FH-dörrar/DIN179/1125)",null,{"$f":"HLOOKUP($I$3,$A$234:$G$381,148,FALSE)","v":"(**) Bemærk, at montering af panikstangen kræver en speciel skrue B-7850 fra firmaet BKS. Den medfølger ikke. (godkendt til FH-døre / DIN179 / 1125)"},null,148]
["zugelassen für FH Türen","approved for fire retardant doors","homologation pour portes FH","omologata per porte FH","toegelaten voor FH-deuren","godkendt til FH-døre","godkänd för FH-dörrar",null,{"$f":"HLOOKUP($I$3,$A$234:$G$382,149,FALSE)","v":"godkendt til FH-døre"},null,149]
["(***) zugelassen für FH Türen / DIN179 / 1125","(***) approved for fire retardant doors / DIN179 / 1125","(***) homologation pour portes FH/DIN179/1125","(***) omologata per porte FH / DIN179 / 1125","(***) toegelaten voor FH-deuren / DIN179 / 1125","(***) godkendt til FH-døre / DIN179 / 1125","(***) godkänd för FH-dörrar/DIN179/1125",null,{"$f":"HLOOKUP($I$3,$A$234:$G$384,150,FALSE)","v":"(***) godkendt til FH-døre / DIN179 / 1125"},null,150]
[" (***) Zusatz-\nInformation"," (***) additional\ninformation","(***) informations\ncomplémentaires "," (***) Informazioni\naggiuntive","(***) Extra\ninformatie ","(***) Yderlige informationer ","(***) Extra\ninformation ",null,{"$f":"HLOOKUP($I$3,$A$234:$G$384,151,FALSE)","v":"(***) Yderlige informationer "},null,151]
[null,null,null,null,null,null,null,null,null,null,152]
[null,null,null,null,null,null,null,null,null,null,153]
[null,null,null,null,null,null,null,null,null,null,154]
[null,null,null,null,null,null,null,null,null,null,155]
[null,null,null,null,null,null,null,null,null,null,156]
[null,null,null,null,null,null,null,null,null,null,157]
[null,null,null,null,null,null,null,null,null,null,158]
[null,null,null,null,null,null,null,null,null,null,159]
[null,null,null,null,null,null,null,null,null,null,160]
[null,null,null,null,null,null,null,null,null,null,161]
[null,null,null,null,null,null,null,null,null,null,162]
[null,null,null,null,null,null,null,null,null,null,163]
[null,null,null,null,null,null,null,null,null,null,164]
[null,null,null,null,null,null,null,null,null,null,165]
[null,null,null,null,null,null,null,null,null,null,166]
[null,null,null,null,null,null,null,null,null,null,167]
[null,null,null,null,null,null,null,null,null,null,168]
[null,null,null,null,null,null,null,null,null,null,169]
[null,null,null,null,null,null,null,null,null,null,170]
[null,null,null,null,null,null,null,null,null,null,171]
[null,null,null,null,null,null,null,null,null,null,172]
[null,null,null,null,null,null,null,null,null,null,173]
[null,null,null,null,null,null,null,null,null,null,174]
[null,null,null,null,null,null,null,null,null,null,175]
[null,null,null,null,null,null,null,null,null,null,176]
[null,null,null,null,null,null,null,null,null,null,177]
[null,null,null,null,null,null,null,null,null,null,178]
[null,null,null,null,null,null,null,null,null,null,179]
[null,null,null,null,null,null,null,null,null,null,180]
[null,null,null,null,null,null,null,null,null,null,181]
[null,null,null,null,null,null,null,null,null,null,182]
[null,null,null,null,null,null,null,null,null,null,183]
[null,null,null,null,null,null,null,null,null,null,184]
[null,null,null,null,null,null,null,null,null,null,185]
[null,null,null,null,null,null,null,null,null,null,186]
[null,null,null,null,null,null,null,null,null,null,187]
[null,null,null,null,null,null,null,null,null,null,188]
[null,null,null,null,null,null,null,null,null,null,189]
[null,null,null,null,null,null,null,null,null,null,190]
[null,null,null,null,null,null,null,null,null,null,191]
[null,null,null,null,null,null,null,null,null,null,192]
[null,null,null,null,null,null,null,null,null,null,193]
[null,null,null,null,null,null,null,null,null,null,194]
[null,null,null,null,null,null,null,null,null,null,195]
[null,null,null,null,null,null,null,null,null,null,196]
[null,null,null,null,null,null,null,null,null,null,197]
[null,null,null,null,null,null,null,null,null,null,198]
[null,null,null,null,null,null,null,null,null,null,199]
[null,null,null,null,null,null,null,null,null,null,200]
[null,null,null,null,null,null,null,null,null,null,201]
[null,null,null,null,null,null,null,null,null,null,202]
[null,null,null,null,null,null,null,null,null,null,203]
[null,null,null,null,null,null,null,null,null,null,204]
[null,null,null,null,null,null,null,null,null,null,205]
[null,null,null,null,null,null,null,null,null,null,206]
[null,null,null,null,null,null,null,null,null,null,207]
[null,null,null,null,null,null,null,null,null,null,208]
[null,null,null,null,null,null,null,null,null,null,209]
[null,null,null,null,null,null,null,null,null,null,210]
[null,null,null,null,null,null,null,null,null,null,211]
[null,null,null,null,null,null,null,null,null,null,212]
[null,null,null,null,null,null,null,null,null,null,213]
[null,null,null,null,null,null,null,null,null,null,214]
[null,null,null,null,null,null,null,null,null,null,215]
[null,null,null,null,null,null,null,null,null,null,216]
[null,null,null,null,null,null,null,null,null,null,217]
[null,null,null,null,null,null,null,null,null,null,218]
[null,null,null,null,null,null,null,null,null,null,219]
[null,null,null,null,null,null,null,null,null,null,220]
[null,null,null,null,null,null,null,null,null,null,221]
[null,null,null,null,null,null,null,null,null,null,222]
[null,null,null,null,null,null,null,null,null,null,223]
[null,null,null,null,null,null,null,null,null,null,224]
[null,null,null,null,null,null,null,null,null,null,225]
[null,null,null,null,null,null,null,null,null,null,226]
[null,null,null,null,null,null,null,null,null,null,227]
[null,null,null,null,null,null,null,null,null,null,228]
[null,null,null,null,null,null,null,null,null,null,229]
[null,null,null,null,null,null,null,null,null,null,230]
[null,null,null,null,null,null,null,null,null,null,231]
[null,null,null,null,null,null,null,null,null,null,232]
[null,null,null,null,null,null,null,null,null,null,233]
[null,null,null,null,null,null,null,null,null,null,234]
[null,null,null,null,null,null,null,null,null,null,235]
[null,null,null,null,null,null,null,null,null,null,236]
[null,null,null,null,null,null,null,null,null,null,237]
[null,null,null,null,null,null,null,null,null,null,238]
[null,null,null,null,null,null,null,null,null,null,239]
[null,null,null,null,null,null,null,null,null,null,240]
[null,null,null,null,null,null,null,null,null,null,241]
[null,null,null,null,null,null,null,null,null,null,242]
[null,null,null,null,null,null,null,null,null,null,243]
[null,null,null,null,null,null,null,null,null,null,244]
[null,null,null,null,null,null,null,null,null,null,245]
[null,null,null,null,null,null,null,null,null,null,246]
[null,null,null,null,null,null,null,null,null,null,247]
[null,null,null,null,null,null,null,null,null,null,248]
[null,null,null,null,null,null,null,null,null,null,249]
[null,null,null,null,null,null,null,null,null,null,250]
[null,null,null,null,null,null,null,null,null,null,251]
[null,null,null,null,null,null,null,null,null,null,252]
[null,null,null,null,null,null,null,null,null,null,253]
[null,null,null,null,null,null,null,null,null,null,254]
[null,null,null,null,null,null,null,null,null,null,255]
[null,null,null,null,null,null,null,null,null,null,256]
[null,null,null,null,null,null,null,null,null,null,257]
[null,null,null,null,null,null,null,null,null,null,258]
[null,null,null,null,null,null,null,null,null,null,259]
[null,null,null,null,null,null,null,null,null,null,260]
[null,null,null,null,null,null,null,null,null,null,261]
[null,null,null,null,null,null,null,null,null,null,262]
[null,null,null,null,null,null,null,null,null,null,263]
[null,null,null,null,null,null,null,null,null,null,264]
[null,null,null,null,null,null,null,null,null,null,265]
[null,null,null,null,null,null,null,null,null,null,266]
[null,null,null,null,null,null,null,null,null,null,267]
[null,null,null,null,null,null,null,null,null,null,268]
[null,null,null,null,null,null,null,null,null,null,269]
[null,null,null,null,null,null,null,null,null,null,270]
[null,null,null,null,null,null,null,null,null,null,271]
[null,null,null,null,null,null,null,null,null,null,272]
[null,null,null,null,null,null,null,null,null,null,273]
[null,null,null,null,null,null,null,null,null,null,274]
[null,null,null,null,null,null,null,null,null,null,275]
[null,null,null,null,null,null,null,null,null,null,276]
[null,null,null,null,null,null,null,null,null,null,277]
[null,null,null,null,null,null,null,null,null,null,278]
[null,null,null,null,null,null,null,null,null,null,279]
[null,null,null,null,null,null,null,null,null,null,280]
[null,null,null,null,null,null,null,null,null,null,281]
[null,null,null,null,null,null,null,null,null,null,282]
[null,null,null,null,null,null,null,null,null,null,283]
[null,null,null,null,null,null,null,null,null,null,284]
[null,null,null,null,null,null,null,null,null,null,285]
[null,null,null,null,null,null,null,null,null,null,286]
[null,null,null,null,null,null,null,null,null,null,287]
[null,null,null,null,null,null,null,null,null,null,288]
[null,null,null,null,null,null,null,null,null,null,289]
[null,null,null,null,null,null,null,null,null,null,290]
[null,null,null,null,null,null,null,null,null,null,291]
[null,null,null,null,null,null,null,null,null,null,292]
[null,null,null,null,null,null,null,null,null,null,293]
[null,null,null,null,null,null,null,null,null,null,294]
[null,null,null,null,null,null,null,null,null,null,295]
[null,null,null,null,null,null,null,null,null,null,296]
[null,null,null,null,null,null,null,null,null,null,297]
[null,null,null,null,null,null,null,null,null,null,298]
[null,null,null,null,null,null,null,null,null,null,299]
[null,null,null,null,null,null,null,null,null,null,300]
[null,null,null,null,null,null,null,null,null,null,301]
[null,null,null,null,null,null,null,null,null,null,302]
[null,null,null,null,null,null,null,null,null,null,303]
[null,null,null,null,null,null,null,null,null,null,304]
[null,null,null,null,null,null,null,null,null,null,305]
[null,null,null,null,null,null,null,null,null,null,306]
[null,null,null,null,null,null,null,null,null,null,307]
[null,null,null,null,null,null,null,null,null,null,308]
[null,null,null,null,null,null,null,null,null,null,309]
[null,null,null,null,null,null,null,null,null,null,310]
[null,null,null,null,null,null,null,null,null,null,311]
[null,null,null,null,null,null,null,null,null,null,312]
[null,null,null,null,null,null,null,null,null,null,313]
[null,null,null,null,null,null,null,null,null,null,314]
[null,null,null,null,null,null,null,null,null,null,315]
[null,null,null,null,null,null,null,null,null,null,316]
[null,null,null,null,null,null,null,null,null,null,317]
[null,null,null,null,null,null,null,null,null,null,318]
[null,null,null,null,null,null,null,null,null,null,319]
[null,null,null,null,null,null,null,null,null,null,320]
[null,null,null,null,null,null,null,null,null,null,321]
[null,null,null,null,null,null,null,null,null,null,322]
[null,null,null,null,null,null,null,null,null,null,323]
[null,null,null,null,null,null,null,null,null,null,324]
[null,null,null,null,null,null,null,null,null,null,325]
[null,null,null,null,null,null,null,null,null,null,326]
[null,null,null,null,null,null,null,null,null,null,327]
[null,null,null,null,null,null,null,null,null,null,328]
[null,null,null,null,null,null,null,null,null,null,329]
[null,null,null,null,null,null,null,null,null,null,330]
[null,null,null,null,null,null,null,null,null,null,331]
[null,null,null,null,null,null,null,null,null,null,332]
[null,null,null,null,null,null,null,null,null,null,333]
[null,null,null,null,null,null,null,null,null,null,334]
[null,null,null,null,null,null,null,null,null,null,335]
[null,null,null,null,null,null,null,null,null,null,336]
[null,null,null,null,null,null,null,null,null,null,337]
[null,null,null,null,null,null,null,null,null,null,338]
[null,null,null,null,null,null,null,null,null,null,339]
[null,null,null,null,null,null,null,null,null,null,340]
[null,null,null,null,null,null,null,null,null,null,341]
[null,null,null,null,null,null,null,null,null,null,342]
[null,null,null,null,null,null,null,null,null,null,343]
[null,null,null,null,null,null,null,null,null,null,344]
[null,null,null,null,null,null,null,null,null,null,345]
[null,null,null,null,null,null,null,null,null,null,346]
[null,null,null,null,null,null,null,null,null,null,347]
[null,null,null,null,null,null,null,null,null,null,348]
[null,null,null,null,null,null,null,null,null,null,349]
[null,null,null,null,null,null,null,null,null,null,350]
[null,null,null,null,null,null,null,null,null,null,351]
[null,null,null,null,null,null,null,null,null,null,352]
[null,null,null,null,null,null,null,null,null,null,353]
[null,null,null,null,null,null,null,null,null,null,354]
[null,null,null,null,null,null,null,null,null,null,355]
[null,null,null,null,null,null,null,null,null,null,356]
[null,null,null,null,null,null,null,null,null,null,357]
[null,null,null,null,null,null,null,null,null,null,358]
[null,null,null,null,null,null,null,null,null,null,359]
[null,null,null,null,null,null,null,null,null,null,360]
[null,null,null,null,null,null,null,null,null,null,361]
[null,null,null,null,null,null,null,null,null,null,362]
[null,null,null,null,null,null,null,null,null,null,363]
[null,null,null,null,null,null,null,null,null,null,364]
[null,null,null,null,null,null,null,null,null,null,365]
[null,null,null,null,null,null,null,null,null,null,366]
[null,null,null,null,null,null,null,null,null,null,367]
[null,null,null,null,null,null,null,null,null,null,368]
[null,null,null,null,null,null,null,null,null,null,369]
[null,null,null,null,null,null,null,null,null,null,370]
[null,null,null,null,null,null,null,null,null,null,371]
[null,null,null,null,null,null,null,null,null,null,372]
[null,null,null,null,null,null,null,null,null,null,373]
[null,null,null,null,null,null,null,null,null,null,374]
[null,null,null,null,null,null,null,null,null,null,375]
[null,null,null,null,null,null,null,null,null,null,376]
[null,null,null,null,null,null,null,null,null,null,377]
[null,null,null,null,null,null,null,null,null,null,378]
[null,null,null,null,null,null,null,null,null,null,379]
[null,null,null,null,null,null,null,null,null,null,380]
[null,null,null,null,null,null,null,null,null,null,381]
[null,null,null,null,null,null,null,null,null,null,382]
[null,null,null,null,null,null,null,null,null,null,383]
[null,null,null,null,null,null,null,null,null,null,384]
[null,null,null,null,null,null,null,null,null,null,385]
[null,null,null,null,null,null,null,null,null,null,386]
[null,null,null,null,null,null,null,null,null,null,387]
[null,null,null,null,null,null,null,null,null,null,388]
[null,null,null,null,null,null,null,null,null,null,389]
[null,null,null,null,null,null,null,null,null,null,390]
[null,null,null,null,null,null,null,null,null,null,391]
[null,null,null,null,null,null,null,null,null,null,392]
[null,null,null,null,null,null,null,null,null,null,393]
[null,null,null,null,null,null,null,null,null,null,394]
[null,null,null,null,null,null,null,null,null,null,395]
[null,null,null,null,null,null,null,null,null,null,396]
[null,null,null,null,null,null,null,null,null,null,397]
[null,null,null,null,null,null,null,null,null,null,398]
[null,null,null,null,null,null,null,null,null,null,399]
[null,null,null,null,null,null,null,null,null,null,400]
[null,null,null,null,null,null,null,null,null,null,401]
[null,null,null,null,null,null,null,null,null,null,402]
[null,null,null,null,null,null,null,null,null,null,403]
[null,null,null,null,null,null,null,null,null,null,404]
[null,null,null,null,null,null,null,null,null,null,405]
[null,null,null,null,null,null,null,null,null,null,406]
[null,null,null,null,null,null,null,null,null,null,407]
[null,null,null,null,null,null,null,null,null,null,408]
[null,null,null,null,null,null,null,null,null,null,409]
[null,null,null,null,null,null,null,null,null,null,410]
[null,null,null,null,null,null,null,null,null,null,411]
[null,null,null,null,null,null,null,null,null,null,412]
[null,null,null,null,null,null,null,null,null,null,413]
[null,null,null,null,null,null,null,null,null,null,414]
[null,null,null,null,null,null,null,null,null,null,415]
[null,null,null,null,null,null,null,null,null,null,416]
[null,null,null,null,null,null,null,null,null,null,417]
[null,null,null,null,null,null,null,null,null,null,418]
[null,null,null,null,null,null,null,null,null,null,419]
[null,null,null,null,null,null,null,null,null,null,420]
[null,null,null,null,null,null,null,null,null,null,421]
[null,null,null,null,null,null,null,null,null,null,422]
[null,null,null,null,null,null,null,null,null,null,423]
[null,null,null,null,null,null,null,null,null,null,424]
[null,null,null,null,null,null,null,null,null,null,425]
[null,null,null,null,null,null,null,null,null,null,426]
[null,null,null,null,null,null,null,null,null,null,427]
[null,null,null,null,null,null,null,null,null,null,428]
[null,null,null,null,null,null,null,null,null,null,429]
[null,null,null,null,null,null,null,null,null,null,430]
[null,null,null,null,null,null,null,null,null,null,431]
[null,null,null,null,null,null,null,null,null,null,432]
[null,null,null,null,null,null,null,null,null,null,433]
[null,null,null,null,null,null,null,null,null,null,434]
[null,null,null,null,null,null,null,null,null,null,435]
[null,null,null,null,null,null,null,null,null,null,436]
[null,null,null,null,null,null,null,null,null,null,437]
[null,null,null,null,null,null,null,null,null,null,438]
[null,null,null,null,null,null,null,null,null,null,439]
[null,null,null,null,null,null,null,null,null,null,440]
[null,null,null,null,null,null,null,null,null,null,441]
[null,null,null,null,null,null,null,null,null,null,442]
[null,null,null,null,null,null,null,null,null,null,443]
[null,null,null,null,null,null,null,null,null,null,444]
[null,null,null,null,null,null,null,null,null,null,445]
[null,null,null,null,null,null,null,null,null,null,446]
[null,null,null,null,null,null,null,null,null,null,447]
[null,null,null,null,null,null,null,null,null,null,448]
[null,null,null,null,null,null,null,null,null,null,449]
[null,null,null,null,null,null,null,null,null,null,450]
[null,null,null,null,null,null,null,null,null,null,451]
[null,null,null,null,null,null,null,null,null,null,452]
[null,null,null,null,null,null,null,null,null,null,453]
[null,null,null,null,null,null,null,null,null,null,454]
[null,null,null,null,null,null,null,null,null,null,455]
[null,null,null,null,null,null,null,null,null,null,456]
[null,null,null,null,null,null,null,null,null,null,457]
[null,null,null,null,null,null,null,null,null,null,458]
[null,null,null,null,null,null,null,null,null,null,459]
[null,null,null,null,null,null,null,null,null,null,460]
[null,null,null,null,null,null,null,null,null,null,461]
[null,null,null,null,null,null,null,null,null,null,462]
[null,null,null,null,null,null,null,null,null,null,463]
[null,null,null,null,null,null,null,null,null,null,464]
[null,null,null,null,null,null,null,null,null,null,465]
[null,null,null,null,null,null,null,null,null,null,466]
[null,null,null,null,null,null,null,null,null,null,467]
[null,null,null,null,null,null,null,null,null,null,468]
[null,null,null,null,null,null,null,null,null,null,469]
[null,null,null,null,null,null,null,null,null,null,470]
[null,null,null,null,null,null,null,null,null,null,471]
[null,null,null,null,null,null,null,null,null,null,472]
[null,null,null,null,null,null,null,null,null,null,473]
[null,null,null,null,null,null,null,null,null,null,474]
[null,null,null,null,null,null,null,null,null,null,475]
[null,null,null,null,null,null,null,null,null,null,476]
[null,null,null,null,null,null,null,null,null,null,477]
[null,null,null,null,null,null,null,null,null,null,478]
[null,null,null,null,null,null,null,null,null,null,479]
[null,null,null,null,null,null,null,null,null,null,480]
[null,null,null,null,null,null,null,null,null,null,481]
[null,null,null,null,null,null,null,null,null,null,482]
[null,null,null,null,null,null,null,null,null,null,483]
[null,null,null,null,null,null,null,null,null,null,484]
[null,null,null,null,null,null,null,null,null,null,485]
[null,null,null,null,null,null,null,null,null,null,486]
[null,null,null,null,null,null,null,null,null,null,487]
[null,null,null,null,null,null,null,null,null,null,488]
[null,null,null,null,null,null,null,null,null,null,489]
[null,null,null,null,null,null,null,null,null,null,490]
[null,null,null,null,null,null,null,null,null,null,491]
[null,null,null,null,null,null,null,null,null,null,492]
[null,null,null,null,null,null,null,null,null,null,493]
[null,null,null,null,null,null,null,null,null,null,494]
[null,null,null,null,null,null,null,null,null,null,495]
[null,null,null,null,null,null,null,null,null,null,496]
[null,null,null,null,null,null,null,null,null,null,497]
[null,null,null,null,null,null,null,null,null,null,498]
[null,null,null,null,null,null,null,null,null,null,499]
[null,null,null,null,null,null,null,null,null,null,500]

{"sheet":"Bilder","index":2,"n_rows":36,"n_cols":26,"rows_kept":36,"cut":false,"hidden":true,"merged":[]}
["Bemaßung","Deutsch","English","Français","Italiano","Nederlands"]
[]
[]
[]
[]
["Drücker","A.","B.","C.","D.","E.","F."]
[]
[]
[]
[]
[]
[]
[]
["Einbinden von Fotos:","Fotos in Zelle unten einfügen mit \"einfügen als Bitmap"]
[null,"Markieren von A24 bis H24 --> STRG + Shift + F3 --> Namen erstellen aus den Werten aus \"linker Spalte\""]
[null,"Markieren von B24 bis H25 --> STRG + Shift + F3 --> Namen erstellen aus den Werten aus \"oberster Zeile\""]
[]
[]
[]
[]
[]
[]
[]
["Drücker_neu","A.","B.","C.","D.","L.","F.","G.","H."]
[]
[]
[null,null,null,null,null,null,null,null,null,"Aussen","A1_","A2_","A3_","A4_","A5_","A6_","A7_","A8_","A9_","A10_","A11_","XXX",null,null,null,"XXX"]
[]
[null,null,null,null,null,null,null,null,"Bemaßung2","Innen","I1_","I2_","I3_","I4_","I5_","I6_","I7_","I8_","I9_","XXX"]
[]
[]
[]
[]
[]
[]
[null,null,null,null,null,null,null,null,null,null,null,null,null,null,null," "]

{"sheet":"SI_Programming_Gateways","index":3,"n_rows":656,"n_cols":31,"rows_kept":656,"cut":false,"hidden":true,"merged":[[43,14,43,15],[40,8,40,13],[39,8,39,13],[41,8,41,13],[14,1,14,2],[14,4,14,5],[14,12,14,14],[14,6,14,9],[36,3,36,4],[37,3,37,4],[38,3,38,4],[36,1,36,2],[37,1,37,2],[38,1,38,2],[5,13,5,14],[12,11,12,13],[36,8,36,13],[37,8,37,13],[38,8,38,13],[11,14,11,15],[12,14,12,15],[1,7,1,10],[7,3,7,4],[12,6,12,7],[3,7,3,10],[5,2,5,4],[6,1,6,2],[12,4,12,5],[5,0,5,1]]}
[]
["SmartIntego -"]
[{"$f":"HLOOKUP($W$16,A158:F179,22,0)","v":"Ordering Guide programming & Gateways"},null,null,null,null,null,null,null,{"$f":"'Hauptseite - main page'!G3","v":"Dansk"}]
[null,null,null,null,null,null,null,{"$f":"HLOOKUP($W$16,A158:F190,33,0)","v":"*** Aktiver venligst makroer ***"}]
[]
[{"$f":"HLOOKUP($W$16,A158:F180,23,0)","v":"Europrofil / Schweizisk Rund"},null,{"$f":"HLOOKUP($W$16,A158:F207,50,0)","v":"Skandinavisk Oval"},null,null,null,null,{"$f":"HLOOKUP($W$16,A158:F181,24,0)","v":"Vælg håndtagsvariant"},null,null,null,null,null,{"$f":"HYPERLINK(HLOOKUP($W$16,A158:F208,51,0),HLOOKUP($W$16,A158:F189,32,0))","v":"Download bestillingsvejledning"}]
[{"$f":"I3","v":"Dansk"},null,null,null,null,null,null,"A."]
[]
[]
[null,null,null,null," "]
[]
[]
[{"$f":"HLOOKUP($W$16,A158:F179,17,0)","v":"Kundenummer"},{"$f":"IF('Hauptseite - main page'!C8<>\"\",'Hauptseite - main page'!C8,\"\")","v":123456},null,null,{"$f":"HLOOKUP($W$16,A158:F179,19,0)","v":"Projektnummer"},null,{"$f":"IF('Hauptseite - main page'!C11<>\"\",'Hauptseite - main page'!C11,\"\")","v":"Test project"},null,null,null,null,{"$f":"HLOOKUP($W$16,A158:F179,21,0)","v":"Tillæg til ordrenummer"}]
[]
[{"$f":"HLOOKUP($W$16,A158:F179,18,0)","v":"Kundenavn"},{"$f":"IF('Hauptseite - main page'!C9<>\"\",'Hauptseite - main page'!C9,\"\")","v":"Test customer"},null,null,{"$f":"HLOOKUP($W$16,A158:F179,20,0)","v":"Projektnavn"},null,{"$f":"IF('Hauptseite - main page'!C12<>\"\",'Hauptseite - main page'!C12,\"\")","v":"19-Test"},null,null,null,null,{"$f":"HLOOKUP($W$16,A158:F233,76,0)","v":"noch zu übersetzen"},{"$f":"IF('Hauptseite - main page'!I9<>\"\",'Hauptseite - main page'!I9,\"\")","v":"to the office address"}]
[null,null,null,null,null,null,null,null,null,null,null,null,null,null,null,null,null,null,null,null,null,null,{"$f":"'Hauptseite - main page'!G3:G3","v":"Dansk"}]
[{"$f":"HLOOKUP($W$16,A158:F179,2,0)","v":"Antal"},{"$f":"HLOOKUP($W$16,A158:F220,63,0)","v":"Wireless Online / Virtual CardNetwork"},{"$f":"HLOOKUP($W$16,A158:F215,56,0)","v":"SmartHandle type"},{"$f":"HLOOKUP($W$16,A158:F215,3,0)","v":"SmartHandle / Langskilt type"},{"$f":"HLOOKUP($W$16,A158:F179,5,0)","v":"Dørtykkelse"},{"$f":"HLOOKUP($W$16,A158:F179,6,0)","v":"Grebspind"},{"$f":"HLOOKUP($W$16,A158:F179,7,0)","v":"Fastsættelse / Bagplade bredde"},{"$f":"HLOOKUP($W$16,A158:F179,8,0)","v":"Centerafstand"},{"$f":"HLOOKUP($W$16,A158:F179,9,0)","v":"Version"},{"$f":"HLOOKUP($W$16,A158:F179,10,0)","v":"Håndtagsvarianter Udendørs"},{"$f":"HLOOKUP($W$16,A158:F179,11,0)","v":"Håndtagsvarianter Indendørs"},{"$f":"HLOOKUP($W$16,A158:F179,12,0)","v":"Overflade"},{"$f":"HLOOKUP($W$16,A158:F179,13,0)","v":"Læseteknologi"},{"$f":"HLOOKUP($W$16,A158:F179,15,0)","v":"Indstillinger"},{"$f":"HLOOKUP($W$16,A158:F179,16,0)","v":"Komplet varenummer"},{"$f":"HLOOKUP($W$16,A158:F188,31,0)","v":"Korrekt varenummer?"},null,null,null,null,null,null,"Wireless Online / Virual Card Network","SmartHandle Typ","Profil","Optionen","Messing?"]
[3,"Wireless Online","Standard SmartHandle (without Door Monitoring)","Europrofile without MO","M","08","B",72,1,"B","B",1,"A",null,{"$f":"IF($C18<>\"\",\"SI.\",\"\")&IF($D18<>\"\",$O143,\"\")&E18&F18&G18&H18&I18&J18&K18&L18&M18&N18","v":{"$error":"#N/A"}},{"$f":"IF(AND(A18<>\"\",C18<>\"\",D18<>\"\",E18<>\"\",F18<>\"\",G18<>\"\",H18<>\"\",I18<>\"\",J18<>\"\",K18<>\"\",L18<>\"\",M18<>\"\"),$B$215,$A$215)","v":"P"},{"$f":"IF(AND(O18<>\"\",P18<>$B$215),1,0)","v":{"$error":"#N/A"}},null,null,null,null,null,{"$f":"IF(B18<>\"\",\", \"&B18,\"\")","v":", Wireless Online"},{"$f":"IF(C18<>\"\",C18,\"\")","v":"Standard SmartHandle (without Door Monitoring)"},{"$f":"IF(D18<>\"\",\", \"&D18,\"\")","v":", Europrofile without MO"},{"$f":"IF(N18<>\"\",\", \"&N18,\"\")","v":""},{"$f":"IF(AND(O18<>\"\",L18=3),\", \"&$J$245,\"\")","v":{"$error":"#N/A"}},{"$f":"X18&Y18&W18&Z18&AA18","v":{"$error":"#N/A"}}]
[2,"Virtual CardNetwork","Door Monitoring (handle sensor)","Scandinavian Oval with MO","S","08","F","05",4,"C","C",3,3,"WP",{"$error":"#N/A"},"P",{"$f":"IF(AND(O19<>\"\",P19<>$B$215),1,0)","v":{"$error":"#N/A"}},null,null,null,null,null,{"$f":"IF(B19<>\"\",\", \"&B19,\"\")","v":", Virtual CardNetwork"},{"$f":"IF(C19<>\"\",C19,\"\")","v":"Door Monitoring (handle sensor)"},{"$f":"IF(D19<>\"\",\", \"&D19,\"\")","v":", Scandinavian Oval with MO"},{"$f":"IF(N19<>\"\",\", \"&N19,\"\")","v":", WP"},{"$f":"IF(AND(O19<>\"\",L19=3),\", \"&$J$245,\"\")","v":{"$error":"#N/A"}},{"$f":"X19&Y19&W19&Z19&AA19","v":{"$error":"#N/A"}}]
[null,null,null,null,null,null,null,null,null,null,null,null,null,null,"","Î",0,null,null,null,null,null,"","","","",{"$f":"IF(AND(O20<>\"\",L20=3),\", \"&$J$245,\"\")","v":""},""]
[null,null,null,null,null,null,null,null,null,null,null,null,null,null,"","Î",0,null,null,null,null,null,"","","","","",""]
[null,null,null,null,null,null,null,null,null,null,null,null,null,null,"","Î",0,null,null,null,null,null,"","","","","",""]
[null,null,null,null,null,null,null,null,null,null,null,null,null,null,"","Î",0,null,null,null,null,null,"","","","","",""]
[null,null,null,null,null,null,null,null,null,null,null,null,null,null,"","Î",0,null,null,null,null,null,"","","","","",""]
[null,null,null,null,null,null,null,null,null,null,null,null,null,null,"","Î",0,null,null,null,null,null,"","","","","",""]
[null,null,null,null,null,null,null,null,null,null,null,null,null,null,"","Î",0,null,null,null,null,null,"","","","","",""]
[null,null,null,null,null,null,null,null,null,null,null,null,null,null,"","Î",0,null,null,null,null,null,"","","","","",""]
[null,null,null,null,null,null,null,null,null,null,null,null,null,null,"","Î",0,null,null,null,null,null,"","","","","",""]
[null,null,null,null,null,null,null,null,null,null,null,null,null,null,"","Î",0,null,null,null,null,null,"","","","","",""]
[null,null,null,null,null,null,null,null,null,null,null,null,null,null,"","Î",0,null,null,null,null,null,"","","","","",""]
[null,null,null,null,null,null,null,null,null,null,null,null,null,null,"","Î",0,null,null,null,null,null,"","","","","",""]
[null,null,null,null,null,null,null,null,null,null,null,null,null,null,"","Î",0,null,null,null,null,null,"","","","","",""]
[null,null,null,null,null,null,null,null,null,null,null,null,null,null,"","Î",0,null,null,null,null,null,"","","","","",""]
[null,null,null,null,null,null,null,null,null,null,null,null,null,null,"","Î",0,null,null,null,null,null,"","","","","",""]
[null,null,null,null,null,null,null,null,null,null,null,null,null,null,null,null,null,null,"Summe aus allen",{"$f":"R43+S43","v":5}]
[{"$f":"HLOOKUP($W$16,A158:F210,44,0)","v":"Konfiguration (hardware & software)"},null,null,null,null,null,null,"Gateway Nodes SmartIntego"]
[{"$f":"HLOOKUP($W$16,A158:F179,2,0)","v":"Antal"},{"$f":"HLOOKUP($W$16,A158:F210,45,0)","v":"Produktbeskrivelse"},null,{"$f":"HLOOKUP($W$16,A158:F210,46,0)","v":"Varenummer"},null,null,null,{"$f":"HLOOKUP(I3,A158:F179,2,0)","v":"Antal"},{"$f":"HLOOKUP($W$16,A158:F210,45,0)","v":"Produktbeskrivelse"},null,null,null,null,null,{"$f":"HLOOKUP($W$16,A158:F210,46,0)","v":"Varenummer"},null,null,"Programming","Nodes",null,"Programming",null,null,"Nodes"]
[null,null,null,{"$f":"IF(ISERROR(VLOOKUP($B38,J$159:$K$160,2,FALSE)),\"\",VLOOKUP($B38,J$159:$K$160,2,FALSE))","v":""},null,null,null,null,null,null,null,null,null,null,{"$f":"IF(ISERROR(VLOOKUP($I38,J$163:$K$167,2,FALSE)),\"\",VLOOKUP($I38,J$163:$K$167,2,FALSE))","v":"SI.N.IO"},null,null,{"$f":"U38+V38","v":0},{"$f":"X38+Y38","v":1},null,{"$f":"IF(AND(D38<>\"\",A38=\"\"),1,0)","v":0},{"$f":"IF(AND(A38<>\"\",B38=\"\"),1,0)","v":0},null,{"$f":"IF(AND(O38<>\"\",H38=\"\"),1,0)","v":1},{"$f":"IF(AND(H38<>\"\",I38=\"\"),1,0)","v":0}]
[null,null,null,{"$f":"IF(ISERROR(VLOOKUP($B39,J$159:$K$160,2,FALSE)),\"\",VLOOKUP($B39,J$159:$K$160,2,FALSE))","v":""},null,null,null,null,null,null,null,null,null,null,{"$f":"IF(ISERROR(VLOOKUP($I39,J$163:$K$167,2,FALSE)),\"\",VLOOKUP($I39,J$163:$K$167,2,FALSE))","v":"SI.N.IO"},null,null,{"$f":"U39+V39","v":0},{"$f":"X39+Y39","v":1},null,{"$f":"IF(AND(D39<>\"\",A39=\"\"),1,0)","v":0},{"$f":"IF(AND(A39<>\"\",B39=\"\"),1,0)","v":0},null,{"$f":"IF(AND(O39<>\"\",H39=\"\"),1,0)","v":1},{"$f":"IF(AND(H39<>\"\",I39=\"\"),1,0)","v":0}]
[null,null,null,null,null,null,null,null,null,null,null,null,null,null,{"$f":"IF(ISERROR(VLOOKUP($I40,J$163:$K$167,2,FALSE)),\"\",VLOOKUP($I40,J$163:$K$167,2,FALSE))","v":"SI.N.IO"},null,null,0,1,null,0,0,null,1,0]
[null,null,null,null,null,null,null,null,null,null,null,null,null,null,{"$f":"IF(ISERROR(VLOOKUP($I41,J$163:$K$167,2,FALSE)),\"\",VLOOKUP($I41,J$163:$K$167,2,FALSE))","v":"SI.N.IO"},null,null,0,1,null,0,0,null,1,0]
[null,null,null,null,null,null,null,null,null,null,null,null,null,null,{"$f":"IF(ISERROR(VLOOKUP($I42,J$163:$K$167,2,FALSE)),\"\",VLOOKUP($I42,J$163:$K$167,2,FALSE))","v":"SI.N.IO"},null,null,0,1,null,0,0,null,1,0]
[null,null,null,null,null,null,null,null,null,null,null,null,null,null,null,null,null,{"$f":"SUM(R38:R42)","v":0},{"$f":"SUM(S38:S42)","v":5}]
[]
["Profilname","X","Y",null,null,1,2,3,4,5,6,7,8,9,10,11,12]
[{"$f":"IF($I$3=\"Deutsch\",$A182,IF($I$3=\"English\",$B182,IF($I$3=\"Français\",$C182,IF($I$3=\"Italiano\",$D182,IF($I$3=\"Nederlands\",$E182,IF($I$3=\"Dansk\",$F182,\"\"))))))","v":"Europrofil uden udstandsning til låsecylinder"},1,1,null,null,70,"00","05","05",70,"00",72,"00",78,"00","05","05"]
["Schweizisk Rund uden udstandsning til låsecylinder",5,1,null,null,72,null,96,96,72,null,75,null,94]
["Skandinavisk Oval uden udstandsning til låsecylinder",3,3,null,null,75,null,null,null,75,null,78]
["Europrofil med udstandsning til låsecylinder",6,2,null,null,78,null,null,null,78,null,85]
["Schweizisk Rund med udstandsning til låsecylinder",8,2,null,null,85,null,null,null,85,null,88]
["Skandinavisk Oval med udstandsning til låsecylinder",10,2,null,null,88,null,null,null,88,null,90]
[{"$f":"IF($I$3=\"Deutsch\",$A219,IF($I$3=\"English\",$B219,IF($I$3=\"Français\",$C219,IF($I$3=\"Italiano\",$D219,IF($I$3=\"Nederlands\",$E219,IF($I$3=\"Dansk\",$F219,\"\"))))))","v":0},6,4,null,null,90,null,null,null,90,null,92]
[{"$f":"IF($I$3=\"Deutsch\",$A237,IF($I$3=\"English\",$B237,IF($I$3=\"Français\",$C237,IF($I$3=\"Italiano\",$D237,IF($I$3=\"Nederlands\",$E237,IF($I$3=\"Dansk\",$F237,\"\"))))))","v":"noch zu übersetzen"},8,4,null,null,92,null,null,null,94]
[{"$f":"IF($I$3=\"Deutsch\",$A238,IF($I$3=\"English\",$B238,IF($I$3=\"Français\",$C238,IF($I$3=\"Italiano\",$D238,IF($I$3=\"Nederlands\",$E238,IF($I$3=\"Dansk\",$F238,\"\"))))))","v":"noch zu übersetzen"},6,5]
[{"$f":"IF($I$3=\"Deutsch\",$A239,IF($I$3=\"English\",$B239,IF($I$3=\"Français\",$C239,IF($I$3=\"Italiano\",$D239,IF($I$3=\"Nederlands\",$E239,IF($I$3=\"Dansk\",$F239,\"\"))))))","v":"noch zu übersetzen"},8,5]
[]
[]
["Befestigung",null,null,null,null,1,2,3,4,5]
["A",0,0,null,null,"A","E","C","F","E"]
["B",0,0,null,null,"B","F","D","H","G"]
["C",1,0,null,null,"C","G",null,"J","I"]
["D",1,0,null,null,"D","H",null,"L","K"]
["E",1,1,null,null,null,"I"]
["F",1,1,null,null,null,"J"]
["G",1,1,null,null,null,"K"]
["H",1,1,null,null,null,"L"]
["I",1,1]
["J",1,1]
["K",2,2]
["L",2,2]
[]
[]
[]
[]
[]
[]
[]
[]
[]
[]
["Zeile 18",{"$f":"VLOOKUP($G18,$A$59:$C$70,2,FALSE)+VLOOKUP($D18,$A$46:$C$55,2,FALSE)","v":{"$error":"#N/A"}}]
["Zeile 19",{"$f":"VLOOKUP($G19,$A$59:$C$70,2,FALSE)+VLOOKUP($D19,$A$46:$C$52,2,FALSE)","v":{"$error":"#N/A"}}]
["Zeile 20",{"$error":"#N/A"}]
["Zeile 21",{"$error":"#N/A"}]
["Zeile 22",{"$error":"#N/A"}]
["Zeile 23",{"$error":"#N/A"}]
["Zeile 24",{"$error":"#N/A"}]
["Zeile 25",{"$error":"#N/A"}]
["Zeile 26",{"$error":"#N/A"}]
["Zeile 27",{"$error":"#N/A"}]
["Zeile 28",{"$error":"#N/A"}]
["Zeile 29",{"$error":"#N/A"}]
["Zeile 30",{"$error":"#N/A"}]
["Zeile 31",{"$error":"#N/A"}]
["Zeile 32",{"$error":"#N/A"}]
["Zeile 33",{"$error":"#N/A"}]
["Zeile 34",{"$error":"#N/A"}]
[]
[]
[]
[]
[]
[]
[]
[]
[]
[null,null,null,null,null,null,null,null,null,null,null,null,null,null,null,null,null,"Optionen"]
["Türdicke",null,"Drücker außen","Drücker innen","Optionen","Oberfläche","Version",null,null,null,"Lesetechnik",null,"G1/G2",null,null,"Lesetechnik / Optionen"]
["S",null,"A","A","ZK",1,0,1,1,2,0,1,1,2,3,0,1,1,2]
["M",null,"B","B","WPZK",3,1,2,0,"A","A",2,null,"G1","G2","A",2]
["L",null,"C","C","WPZKDP",null,null,null,null,null,null,null,null,"G2",null,3,2,null,"WP"]
[null,null,"D","D","WP"]
[null,null,"E","E"]
[null,null,"F","F"]
[null,null,"G","G"]
[null,null,"H","H"]
["Übersetzung der Profile in Abkürzung",null,null,null,null,"Vierkant"]
[{"$f":"IF($I$3=\"Deutsch\",$A182,IF($I$3=\"English\",$B182,IF($I$3=\"Français\",$C182,IF($I$3=\"Italiano\",$D182,IF($I$3=\"Nederlands\",$E182,IF($I$3=\"Dansk\",$F182,\"\"))))))","v":"Europrofil uden udstandsning til låsecylinder"},1,{"$f":"IF($I$3=\"Deutsch\",$A182,IF($I$3=\"English\",$B182,IF($I$3=\"Français\",$C182,IF($I$3=\"Italiano\",$D182,IF($I$3=\"Nederlands\",$E182,IF($I$3=\"Dansk\",$F182,\"\"))))))","v":"Europrofil uden udstandsning til låsecylinder"},1,null,1,2,3,4,null,null,null,null,null,"Anzeige der möglichen Profile","Anzeige der Version",null,1,2,3,null,"Version"]
["Schweizisk Rund uden udstandsning til låsecylinder",1,"Schweizisk Rund uden udstandsning til låsecylinder",1,null,"07","08","08","08",null,null,null,null,{"$f":"IF($I$3=\"Deutsch\",$A$209,IF($I$3=\"English\",$B$209,IF($I$3=\"Français\",$C$209,IF($I$3=\"Italiano\",$D$209,IF($I$3=\"Nederlands\",$E$209,IF($I$3=\"Dansk\",$F$209,\"\"))))))","v":"Standard SmartHandle (uden dør monitorering)"},1,1,null,{"$f":"IF($I$3=\"Deutsch\",$A182,IF($I$3=\"English\",$B182,IF($I$3=\"Français\",$C182,IF($I$3=\"Italiano\",$D182,IF($I$3=\"Nederlands\",$E182,IF($I$3=\"Dansk\",$F182,\"\"))))))","v":"Europrofil uden udstandsning til låsecylinder"},{"$f":"IF($I$3=\"Deutsch\",$A182,IF($I$3=\"English\",$B182,IF($I$3=\"Français\",$C182,IF($I$3=\"Italiano\",$D182,IF($I$3=\"Nederlands\",$E182,IF($I$3=\"Dansk\",$F182,\"\"))))))","v":"Europrofil uden udstandsning til låsecylinder"},{"$f":"IF($I$3=\"Deutsch\",$A182,IF($I$3=\"English\",$B182,IF($I$3=\"Français\",$C182,IF($I$3=\"Italiano\",$D182,IF($I$3=\"Nederlands\",$E182,IF($I$3=\"Dansk\",$F182,\"\"))))))","v":"Europrofil uden udstandsning til låsecylinder"},null,1,2,3,4]
["Skandinavisk Oval uden udstandsning til låsecylinder",2,"Skandinavisk Oval uden udstandsning til låsecylinder",3,null,"08","F8","F8","F8",null,null,null,null,{"$f":"IF($I$3=\"Deutsch\",$A$210,IF($I$3=\"English\",$B$210,IF($I$3=\"Français\",$C$210,IF($I$3=\"Italiano\",$D$210,IF($I$3=\"Nederlands\",$E$210,IF($I$3=\"Dansk\",$F$210,\"\"))))))","v":"Dør monitorering (SV sensorer)"},2,2,null,{"$f":"IF($I$3=\"Deutsch\",$A183,IF($I$3=\"English\",$B183,IF($I$3=\"Français\",$C183,IF($I$3=\"Italiano\",$D183,IF($I$3=\"Nederlands\",$E183,IF($I$3=\"Dansk\",$F183,\"\"))))))","v":"Schweizisk Rund uden udstandsning til låsecylinder"},null,{"$f":"IF($I$3=\"Deutsch\",$A183,IF($I$3=\"English\",$B183,IF($I$3=\"Français\",$C183,IF($I$3=\"Italiano\",$D183,IF($I$3=\"Nederlands\",$E183,IF($I$3=\"Dansk\",$F183,\"\"))))))","v":"Schweizisk Rund uden udstandsning til låsecylinder"},null,0,2,3,4]
["Europrofil med udstandsning til låsecylinder",3,"Europrofil med udstandsning til låsecylinder",1,null,"F8","09","09","09",null,null,null,null,{"$f":"IF($I$3=\"Deutsch\",$A$211,IF($I$3=\"English\",$B$211,IF($I$3=\"Français\",$C$211,IF($I$3=\"Italiano\",$D$211,IF($I$3=\"Nederlands\",$E$211,IF($I$3=\"Dansk\",$F$211,\"\"))))))","v":"Dørmonitorering"},3,3,null,{"$f":"IF($I$3=\"Deutsch\",$A184,IF($I$3=\"English\",$B184,IF($I$3=\"Français\",$C184,IF($I$3=\"Italiano\",$D184,IF($I$3=\"Nederlands\",$E184,IF($I$3=\"Dansk\",$F184,\"\"))))))","v":"Skandinavisk Oval uden udstandsning til låsecylinder"},null,{"$f":"IF($I$3=\"Deutsch\",$A184,IF($I$3=\"English\",$B184,IF($I$3=\"Français\",$C184,IF($I$3=\"Italiano\",$D184,IF($I$3=\"Nederlands\",$E184,IF($I$3=\"Dansk\",$F184,\"\"))))))","v":"Skandinavisk Oval uden udstandsning til låsecylinder"},null,1]
["Schweizisk Rund med udstandsning til låsecylinder",4,"Schweizisk Rund med udstandsning til låsecylinder",1,null,"09","10",null,null,null,null,null,null,{"$f":"IF($I$3=\"Deutsch\",$A$212,IF($I$3=\"English\",$B$212,IF($I$3=\"Français\",$C$212,IF($I$3=\"Italiano\",$D$212,IF($I$3=\"Nederlands\",$E$212,IF($I$3=\"Dansk\",$F$212,\"\"))))))","v":"Dør monitorering (dørgrebs sensor)"},1,4,null,{"$f":"IF($I$3=\"Deutsch\",$A185,IF($I$3=\"English\",$B185,IF($I$3=\"Français\",$C185,IF($I$3=\"Italiano\",$D185,IF($I$3=\"Nederlands\",$E185,IF($I$3=\"Dansk\",$F185,\"\"))))))","v":"Europrofil med udstandsning til låsecylinder"},null,{"$f":"IF($I$3=\"Deutsch\",$A185,IF($I$3=\"English\",$B185,IF($I$3=\"Français\",$C185,IF($I$3=\"Italiano\",$D185,IF($I$3=\"Nederlands\",$E185,IF($I$3=\"Dansk\",$F185,\"\"))))))","v":"Europrofil med udstandsning til låsecylinder"}]
["Skandinavisk Oval med udstandsning til låsecylinder",5,"Skandinavisk Oval med udstandsning til låsecylinder",3,null,"10",null,null,null,null,null,null,null,null,null,null,null,{"$f":"IF($I$3=\"Deutsch\",$A186,IF($I$3=\"English\",$B186,IF($I$3=\"Français\",$C186,IF($I$3=\"Italiano\",$D186,IF($I$3=\"Nederlands\",$E186,IF($I$3=\"Dansk\",$F186,\"\"))))))","v":"Schweizisk Rund med udstandsning til låsecylinder"},null,{"$f":"IF($I$3=\"Deutsch\",$A186,IF($I$3=\"English\",$B186,IF($I$3=\"Français\",$C186,IF($I$3=\"Italiano\",$D186,IF($I$3=\"Nederlands\",$E186,IF($I$3=\"Dansk\",$F186,\"\"))))))","v":"Schweizisk Rund med udstandsning til låsecylinder"}]
[null,null,{"$f":"IF($I$3=\"Deutsch\",$A219,IF($I$3=\"English\",$B219,IF($I$3=\"Français\",$C219,IF($I$3=\"Italiano\",$D219,IF($I$3=\"Nederlands\",$E219,IF($I$3=\"Dansk\",$F219,\"\"))))))","v":0},1,null,null,null,null,null,null,null,null,null,null,null,null,null,{"$f":"IF($I$3=\"Deutsch\",$A187,IF($I$3=\"English\",$B187,IF($I$3=\"Français\",$C187,IF($I$3=\"Italiano\",$D187,IF($I$3=\"Nederlands\",$E187,IF($I$3=\"Dansk\",$F187,\"\"))))))","v":"Skandinavisk Oval med udstandsning til låsecylinder"},null,{"$f":"IF($I$3=\"Deutsch\",$A187,IF($I$3=\"English\",$B187,IF($I$3=\"Français\",$C187,IF($I$3=\"Italiano\",$D187,IF($I$3=\"Nederlands\",$E187,IF($I$3=\"Dansk\",$F187,\"\"))))))","v":"Skandinavisk Oval med udstandsning til låsecylinder"}]
[null,null,{"$f":"IF($I$3=\"Deutsch\",$A237,IF($I$3=\"English\",$B237,IF($I$3=\"Français\",$C237,IF($I$3=\"Italiano\",$D237,IF($I$3=\"Nederlands\",$E237,IF($I$3=\"Dansk\",$F237,\"\"))))))","v":"noch zu übersetzen"},1,null,null,null,null,null,null,null,null,null,null,null,null,null,{"$f":"IF($I$3=\"Deutsch\",$A219,IF($I$3=\"English\",$B219,IF($I$3=\"Français\",$C219,IF($I$3=\"Italiano\",$D219,IF($I$3=\"Nederlands\",$E219,IF($I$3=\"Dansk\",$F219,\"\"))))))","v":0}]
[null,null,{"$f":"IF($I$3=\"Deutsch\",$A238,IF($I$3=\"English\",$B238,IF($I$3=\"Français\",$C238,IF($I$3=\"Italiano\",$D238,IF($I$3=\"Nederlands\",$E238,IF($I$3=\"Dansk\",$F238,\"\"))))))","v":"noch zu übersetzen"},1,null,null,null,null,null,null,null,null,null,null,null,null,null,{"$f":"IF($I$3=\"Deutsch\",$A237,IF($I$3=\"English\",$B237,IF($I$3=\"Français\",$C237,IF($I$3=\"Italiano\",$D237,IF($I$3=\"Nederlands\",$E237,IF($I$3=\"Dansk\",$F237,\"\"))))))","v":"noch zu übersetzen"}]
[null,null,{"$f":"IF($I$3=\"Deutsch\",$A239,IF($I$3=\"English\",$B239,IF($I$3=\"Français\",$C239,IF($I$3=\"Italiano\",$D239,IF($I$3=\"Nederlands\",$E239,IF($I$3=\"Dansk\",$F239,\"\"))))))","v":"noch zu übersetzen"},1,null,null,null,null,null,null,null,null,null,null,null,null,null,{"$f":"IF($I$3=\"Deutsch\",$A238,IF($I$3=\"English\",$B238,IF($I$3=\"Français\",$C238,IF($I$3=\"Italiano\",$D238,IF($I$3=\"Nederlands\",$E238,IF($I$3=\"Dansk\",$F238,\"\"))))))","v":"noch zu übersetzen"},null,null,null,"Lesetechnik"]
[null,null,null,null,null,null,null,null,null,null,null,null,null,null,null,null,null,{"$f":"IF($I$3=\"Deutsch\",$A239,IF($I$3=\"English\",$B239,IF($I$3=\"Français\",$C239,IF($I$3=\"Italiano\",$D239,IF($I$3=\"Nederlands\",$E239,IF($I$3=\"Dansk\",$F239,\"\"))))))","v":"noch zu übersetzen"},null,null,null,1,2,3,4,5,6,7,8,9,10]
[null,null,"S",0,null,null,null,null,null,null,null,null,null,null,null,null,null,null,null,null,null,0,"A","A","A","A",0,3,3,3,3]
[null,null,"M",0,null,null,null,null,null,null,null,null,null,{"$f":"IF($I$3=\"Deutsch\",$A182,IF($I$3=\"English\",$B182,IF($I$3=\"Français\",$C182,IF($I$3=\"Italiano\",$D182,IF($I$3=\"Nederlands\",$E182,IF($I$3=\"Dansk\",$F182,\"\"))))))","v":"Europrofil uden udstandsning til låsecylinder"},"SHA"]
[null,null,"L",1,null,null,null,null,null,null,null,null,null,"Schweizisk Rund uden udstandsning til låsecylinder","SHA"]
[null,null,null,null,null,null,null,null,null,null,null,null,null,"Skandinavisk Oval uden udstandsning til låsecylinder","SHB",null,null,null,null,null,null,"Version","Lesetechnik"]
[null,null,null,null,null,null,null,null,null,null,null,null,null,"Europrofil med udstandsning til låsecylinder","SHC",null,null,null,null,null,null,0,1]
[null,null,null,null,null,null,null,null,null,null,null,null,null,"Schweizisk Rund med udstandsning til låsecylinder","SHD",null,null,null,null,null,null,1,2]
["Zeile 18",null,null,{"$f":"VLOOKUP($D18,$C$118:$D$127,2,FALSE)+VLOOKUP($E18,$C$129:$D$131,2,FALSE)","v":{"$error":"#N/A"}},null,null,null,null,null,null,null,null,null,"Skandinavisk Oval med udstandsning til låsecylinder","SHE",null,null,null,null,null,null,2,3]
["Zeile 19",null,null,{"$error":"#N/A"},null,null,null,null,null,null,null,null,null,{"$f":"IF($I$3=\"Deutsch\",$A219,IF($I$3=\"English\",$B219,IF($I$3=\"Français\",$C219,IF($I$3=\"Italiano\",$D219,IF($I$3=\"Nederlands\",$E219,IF($I$3=\"Dansk\",$F219,\"\"))))))","v":0},"SHF",null,null,null,null,null,null,3,4]
["Zeile 20",null,null,{"$error":"#N/A"},null,null,null,null,null,null,null,null,null,{"$f":"IF($I$3=\"Deutsch\",$A237,IF($I$3=\"English\",$B237,IF($I$3=\"Français\",$C237,IF($I$3=\"Italiano\",$D237,IF($I$3=\"Nederlands\",$E237,IF($I$3=\"Dansk\",$F237,\"\"))))))","v":"noch zu übersetzen"},"SHG",null,null,null,null,null,null,4,5]
["Zeile 21",null,null,{"$error":"#N/A"},null,null,null,null,null,null,null,null,null,{"$f":"IF($I$3=\"Deutsch\",$A238,IF($I$3=\"English\",$B238,IF($I$3=\"Français\",$C238,IF($I$3=\"Italiano\",$D238,IF($I$3=\"Nederlands\",$E238,IF($I$3=\"Dansk\",$F238,\"\"))))))","v":"noch zu übersetzen"},"SHH"]
["Zeile 22",null,null,{"$error":"#N/A"},null,null,null,null,null,null,null,null,null,{"$f":"IF($I$3=\"Deutsch\",$A239,IF($I$3=\"English\",$B239,IF($I$3=\"Français\",$C239,IF($I$3=\"Italiano\",$D239,IF($I$3=\"Nederlands\",$E239,IF($I$3=\"Dansk\",$F239,\"\"))))))","v":"noch zu übersetzen"},"SHI",null,null,null,null,null,null,"Wireless online / Virtual Card Network"]
["Zeile 23",null,null,{"$error":"#N/A"},null,null,null,null,null,null,null,null,null,null,null,null,null,null,null,null,null,{"$f":"IF($I$3=\"Deutsch\",$A$221,IF($I$3=\"English\",$B$221,IF($I$3=\"Français\",$C$221,IF($I$3=\"Italiano\",$D$221,IF($I$3=\"Nederlands\",$E$221,IF($I$3=\"Dansk\",$F$221,\"\"))))))","v":"Wireless Online"},0]
["Zeile 24",null,null,{"$error":"#N/A"},null,null,null,null,null,null,null,null,null,null,null,null,null,null,null,null,null,{"$f":"IF($I$3=\"Deutsch\",$A$222,IF($I$3=\"English\",$B$222,IF($I$3=\"Français\",$C$222,IF($I$3=\"Italiano\",$D$222,IF($I$3=\"Nederlands\",$E$222,IF($I$3=\"Dansk\",$F$222,\"\"))))))","v":"Virtual CardNetwork"},5]
["Zeile 25",null,null,{"$error":"#N/A"}]
["Zeile 26",null,null,{"$error":"#N/A"},null,null,null,null,null,null,null,null,null,"Zeile 18",{"$f":"VLOOKUP($D18,$N$130:$O$139,2,FALSE)","v":{"$error":"#N/A"}}]
["Zeile 27",null,null,{"$error":"#N/A"},null,null,null,null,null,null,null,null,null,"Zeile 19",{"$error":"#N/A"}]
["Zeile 28",null,null,{"$error":"#N/A"},null,null,null,null,null,null,null,null,null,"Zeile 20","SHF",null,null,null,null,null,null,"Zeile 18",{"$f":"VLOOKUP(I18,$V$133:$W$137,2,FALSE)+VLOOKUP(B18,$V$140:$W$141,2,FALSE)","v":2}]
["Zeile 29",null,null,{"$error":"#N/A"},null,null,null,null,null,null,null,null,null,"Zeile 21","SHF",null,null,null,null,null,null,"Zeile 19",10]
["Zeile 30",null,null,{"$error":"#N/A"},null,null,null,null,null,null,null,null,null,"Zeile 22","SHF",null,null,null,null,null,null,"Zeile 20",{"$error":"#N/A"}]
["Zeile 31",null,null,{"$error":"#N/A"},null,null,null,null,null,null,null,null,null,"Zeile 23","SHF",null,null,null,null,null,null,"Zeile 21",{"$error":"#N/A"}]
["Zeile 32",null,null,{"$error":"#N/A"},null,null,null,null,null,null,null,null,null,"Zeile 24","SHF",null,null,null,null,null,null,"Zeile 22",{"$error":"#N/A"}]
["Zeile 33",null,null,{"$error":"#N/A"},null,null,null,null,null,null,null,null,null,"Zeile 25","SHF",null,null,null,null,null,null,"Zeile 23",{"$error":"#N/A"}]
["Zeile 34",null,null,{"$error":"#N/A"},null,null,null,null,null,null,null,null,null,"Zeile 26","SHF",null,null,null,null,null,null,"Zeile 24",{"$error":"#N/A"}]
[null,null,null,null,null,null,null,null,null,null,null,null,null,"Zeile 27","SHF",null,null,null,null,null,null,"Zeile 25",{"$error":"#N/A"}]
[null,null,null,null,null,null,null,null,null,null,null,null,null,"Zeile 28","SHF",null,null,null,null,null,null,"Zeile 26",{"$error":"#N/A"}]
[null,null,null,null,null,null,null,null,null,null,null,null,null,"Zeile 29","SHF",null,null,null,null,null,null,"Zeile 27",{"$error":"#N/A"}]
[null,null,null,null,null,null,null,null,null,null,null,null,null,"Zeile 30","SHF",null,null,null,null,null,null,"Zeile 28",{"$error":"#N/A"}]
[null,null,null,null,null,null,null,null,null,null,null,null,null,"Zeile 31","SHF",null,null,null,null,null,null,"Zeile 29",{"$error":"#N/A"}]
[null,null,null,null,null,null,null,null,null,null,null,null,null,"Zeile 32","SHF",null,null,null,null,null,null,"Zeile 30",{"$error":"#N/A"}]
["Deutsch","English","Français","Italiano","Nederlands","Dansk",null,null,1,"Programmierung",null,null,null,"Zeile 33","SHF",null,null,null,null,null,null,"Zeile 31",{"$error":"#N/A"}]
["Anzahl","Quantity","Quantité","Quantità","Aantal","Antal",null,null,2,{"$f":"IF($I$3=\"Deutsch\",$A$199,IF($I$3=\"English\",$B$199,IF($I$3=\"Français\",$C$199,IF($I$3=\"Italiano\",$D$199,IF($I$3=\"Nederlands\",$E$199,IF($I$3=\"Dansk\",$F$199,\"\"))))))","v":"Konfigurationsenhed SmartIntego"},"SI.SMARTCD",null,null,"Zeile 34","SHF",null,null,null,null,null,null,"Zeile 32",{"$error":"#N/A"}]
["Profilname","Lock Type","Type de profil","Tipo di profilo","Sluiting type","SmartHandle / Langskilt type",null,null,3,{"$f":"IF($I$3=\"Deutsch\",$A200,IF($I$3=\"English\",$B200,IF($I$3=\"Français\",$C200,IF($I$3=\"Italiano\",$D200,IF($I$3=\"Nederlands\",$E200,IF($I$3=\"Dansk\",$F200,\"\"))))))","v":"Konfigurationssoftware SmartIntego"},"SI.SW",null,null,null,null,null,null,null,null,null,null,"Zeile 33",{"$error":"#N/A"}]
["Profil","Lock Code","Profil","Codice del profilo","Sluiting code","Varenummer",null,null,4,null,null,null,null,null,null,null,null,null,null,null,null,"Zeile 34",{"$error":"#N/A"}]
["Türdicke","Door Thickness","Epaisseur de porte","Spessore porta","Deurdikte","Dørtykkelse",null,null,5,"Gateway Nodes"]
["Vierkant","Spindle Square","Carré","Quadro maniglia","Vierkant stift","Grebspind",null,null,6,{"$f":"IF($I$3=\"Deutsch\",$A223,IF($I$3=\"English\",$B223,IF($I$3=\"Français\",$C223,IF($I$3=\"Italiano\",$D223,IF($I$3=\"Nederlands\",$E223,IF($I$3=\"Dansk\",$F223,\"\"))))))","v":"SmartIntego GatewayNode til konvertering fra RS485 port til 868 MHz"},"SI.GN.CR"]
["Befestigung","Fixing / Back Plate Width","Fixation / largeur de plaque","Fissaggio","Bevestiging/ Grondplaat breed","Fastsættelse / Bagplade bredde",null,null,7,{"$f":"IF($I$3=\"Deutsch\",$A224,IF($I$3=\"English\",$B224,IF($I$3=\"Français\",$C224,IF($I$3=\"Italiano\",$D224,IF($I$3=\"Nederlands\",$E224,IF($I$3=\"Dansk\",$F224,\"\"))))))","v":"SmartIntego GatewayNode til konvertering fra Ethernet (TCP/IP) til 868 MHz"},"SI.GN2.ER"]
["Entfernung","Centre Distance","Distance","Interasse","H.O.H. maat","Centerafstand",null,null,8,{"$f":"IF($I$3=\"Deutsch\",$A225,IF($I$3=\"English\",$B225,IF($I$3=\"Français\",$C225,IF($I$3=\"Italiano\",$D225,IF($I$3=\"Nederlands\",$E225,IF($I$3=\"Dansk\",$F225,\"\"))))))","v":"SmartIntego GatewayNode til at udvide rækkevidden af 868 MHz radioforbindelse"},"SI.GN.R"]
["Version","Version","Version","Versione","Versie","Version",null,null,9,{"$f":"IF($I$3=\"Deutsch\",$A226,IF($I$3=\"English\",$B226,IF($I$3=\"Français\",$C226,IF($I$3=\"Italiano\",$D226,IF($I$3=\"Nederlands\",$E226,IF($I$3=\"Dansk\",$F226,\"\"))))))","v":"SmartIntego GatewayNode med Ethernet - Mercury"},"SI.GN2.ER.M"]
["Drücker außen","Handle Variants Outside","Variantes de la béquille extérieure","Maniglia esterna","Deurkruk type Buiten","Håndtagsvarianter Udendørs",null,null,10,{"$f":"J242","v":0},"SI.N.IO"]
["Drücker innen","Handle Variants Inside","Variantes de la béquille intérieure","Maniglia interna","Deurkruk type Binnen","Håndtagsvarianter Indendørs",null,null,11]
["Oberfläche","Surface Finish","Finition de la surface:","Superficie","Afwerking","Overflade",null,null,12]
["Lesetechnik","Reading Technology","Technique de lecture","Tecnologia di lettura","Leestechniek","Læseteknologi",null,null,13,null,null,null,null,null,null,null,null,null,null,"Version"]
["G1/G2","G1/G2","G1 / G2","G1/G2","G1/G2","G1/G2",null,null,14,null,null,null,null,"Anzeige der möglichen Version","für Version",null,null,null,null,1,2,3,4,5,6,7,8]
["Optionen","Options","Options","Opzioni","Opties","Indstillinger",null,null,15,null,null,null,null,{"$f":"IF($I$3=\"Deutsch\",$A$209,IF($I$3=\"English\",$B$209,IF($I$3=\"Français\",$C$209,IF($I$3=\"Italiano\",$D$209,IF($I$3=\"Nederlands\",$E$209,IF($I$3=\"Dansk\",$F$209,\"\"))))))","v":"Standard SmartHandle (uden dør monitorering)"},1,null,null,null,null,0,2,3,4,1,2,3,4]
["kpl. Artikelnummer","Complete Part Number","Code article complet","Numero articolo completo","Complete onderdeel nummer","Komplet varenummer",null,null,16,null,null,null,null,{"$f":"IF($I$3=\"Deutsch\",$A$210,IF($I$3=\"English\",$B$210,IF($I$3=\"Français\",$C$210,IF($I$3=\"Italiano\",$D$210,IF($I$3=\"Nederlands\",$E$210,IF($I$3=\"Dansk\",$F$210,\"\"))))))","v":"Dør monitorering (SV sensorer)"},2,null,null,null,null,1]
["Kundennummer","Customer No.","Numéro de client","Cliente numero","Klantnr.","Kundenummer",null,null,17,null,null,null,null,{"$f":"IF($I$3=\"Deutsch\",$A$211,IF($I$3=\"English\",$B$211,IF($I$3=\"Français\",$C$211,IF($I$3=\"Italiano\",$D$211,IF($I$3=\"Nederlands\",$E$211,IF($I$3=\"Dansk\",$F$211,\"\"))))))","v":"Dørmonitorering"},3]
["Kundenname","Customer Name","Nom du client","Nome cliente","Klant naam","Kundenavn",null,null,18,null,null,null,null,{"$f":"IF($I$3=\"Deutsch\",$A$212,IF($I$3=\"English\",$B$212,IF($I$3=\"Français\",$C$212,IF($I$3=\"Italiano\",$D$212,IF($I$3=\"Nederlands\",$E$212,IF($I$3=\"Dansk\",$F$212,\"\"))))))","v":"Dør monitorering (dørgrebs sensor)"},4]
["Projekt-Nr.  ","Project No.","Numéro de projet","Progetto numero","Projectnr.","Projektnummer",null,null,19]
["Projekt-Name  ","Project Name","Nom du projet","Nome progetto","Project naam","Projektnavn",null,null,20]
["Anlage zu Bestellnummer  ","Attachment to Order No.","Pièce(s) jointe(s) à la commande","Allegato all'ordine","Bijlage bij ordernr.","Tillæg til ordrenummer",null,null,21,null,null,null,null,null,null,null,null,null,null,null,null,1,2]
["Bestellhilfe Programmierung & Gateways","Ordering Guide programming & Gateways","Ordering Guide programming & Gateways","Ordering Guide programming & Gateways","Ordering Guide programming & Gateways","Ordering Guide programming & Gateways",null,null,22,null,null,null,null,"Vierkant",null,null,"Wireless online / Virtual CardNetwork",null,null,null,null,{"$f":"IF($I$3=\"Deutsch\",$A$209,IF($I$3=\"English\",$B$209,IF($I$3=\"Français\",$C$209,IF($I$3=\"Italiano\",$D$209,IF($I$3=\"Nederlands\",$E$209,IF($I$3=\"Dansk\",$F$209,\"\"))))))","v":"Standard SmartHandle (uden dør monitorering)"},{"$f":"IF($I$3=\"Deutsch\",$A$209,IF($I$3=\"English\",$B$209,IF($I$3=\"Français\",$C$209,IF($I$3=\"Italiano\",$D$209,IF($I$3=\"Nederlands\",$E$209,IF($I$3=\"Dansk\",$F$209,\"\"))))))","v":"Standard SmartHandle (uden dør monitorering)"}]
["Europrofil / Swiss Round","Europrofile / Swiss Round","Profil européen / Profil suisse","profilo europeo / tondo svizzero","Euro profiel / Swiss Round","Europrofil / Schweizisk Rund",null,null,23,null,null,null,null,"07",0,null,{"$f":"IF($I$3=\"Deutsch\",$A$221,IF($I$3=\"English\",$B$221,IF($I$3=\"Français\",$C$221,IF($I$3=\"Italiano\",$D$221,IF($I$3=\"Nederlands\",$E$221,IF($I$3=\"Dansk\",$F$221,\"\"))))))","v":"Wireless Online"},1,null,null,null,{"$f":"IF($I$3=\"Deutsch\",$A$210,IF($I$3=\"English\",$B$210,IF($I$3=\"Français\",$C$210,IF($I$3=\"Italiano\",$D$210,IF($I$3=\"Nederlands\",$E$210,IF($I$3=\"Dansk\",$F$210,\"\"))))))","v":"Dør monitorering (SV sensorer)"},{"$f":"IF($I$3=\"Deutsch\",$A$212,IF($I$3=\"English\",$B$212,IF($I$3=\"Français\",$C$212,IF($I$3=\"Italiano\",$D$212,IF($I$3=\"Nederlands\",$E$212,IF($I$3=\"Dansk\",$F$212,\"\"))))))","v":"Dør monitorering (dørgrebs sensor)"}]
["Drückervariante auswählen","select handle variant","Variantes poignée ","Variante maniglia","Deurkruk variant","Vælg håndtagsvariant",null,null,24,null,null,null,null,"08",0,null,{"$f":"IF($I$3=\"Deutsch\",$A$222,IF($I$3=\"English\",$B$222,IF($I$3=\"Français\",$C$222,IF($I$3=\"Italiano\",$D$222,IF($I$3=\"Nederlands\",$E$222,IF($I$3=\"Dansk\",$F$222,\"\"))))))","v":"Virtual CardNetwork"},2,null,null,null,{"$f":"IF($I$3=\"Deutsch\",$A$211,IF($I$3=\"English\",$B$211,IF($I$3=\"Français\",$C$211,IF($I$3=\"Italiano\",$D$211,IF($I$3=\"Nederlands\",$E$211,IF($I$3=\"Dansk\",$F$211,\"\"))))))","v":"Dørmonitorering"}]
["Europrofil ohne MO","Europrofile without MO","profil européen sans VM","profilo europeo senza MO","Euro profiel zonder MO","Europrofil uden udstandsning til låsecylinder",null,null,25,null,null,null,null,"F8",4,null,null,null,null,null,null,{"$f":"IF($I$3=\"Deutsch\",$A$212,IF($I$3=\"English\",$B$212,IF($I$3=\"Français\",$C$212,IF($I$3=\"Italiano\",$D$212,IF($I$3=\"Nederlands\",$E$212,IF($I$3=\"Dansk\",$F$212,\"\"))))))","v":"Dør monitorering (dørgrebs sensor)"}]
["Swiss Round ohne MO","Swiss Round without MO","profil suisse sans VM","tondo svizzero senza MO","Swiss Round zonder MO","Schweizisk Rund uden udstandsning til låsecylinder",null,null,26,null,null,null,null,"09",4]
["Scandinavian Oval ohne MO","Scandinavian Oval without MO","Ovale scandinave sans VM","Scandinavian Oval senza MO","Scandinavian Oval zonder MO","Skandinavisk Oval uden udstandsning til låsecylinder",null,null,27,null,null,null,null,"10",0]
["Europrofil mit MO","Europrofile with MO","profil européen avec VM","profilo europeo con MO","Euro profiel met MO","Europrofil med udstandsning til låsecylinder",null,null,28,null,null,null,null,null,"Ergebnis für Version",null,"Ergebnis für SH-Typ"]
["Swiss Round mit MO","Swiss Round with MO","profil suisse avec VM","tondo svizzero con MO","Swiss Round met MO","Schweizisk Rund med udstandsning til låsecylinder",null,null,29,null,null,null,null,"Zeile 18",{"$f":"VLOOKUP($C18,$N$172:$O$175,2,FALSE)+VLOOKUP($F18,$N$180:$O$184,2,FALSE)","v":{"$error":"#N/A"}},"Zeile 18",{"$f":"VLOOKUP(B18,$Q$180:$R$181,2,FALSE)","v":1}]
["Scandinavian Oval mit MO","Scandinavian Oval with MO","Ovale scandinave avec VM","Scandinavian Oval con MO","Scandinavian Oval met MO","Skandinavisk Oval med udstandsning til låsecylinder",null,null,30,null,null,null,null,"Zeile 19",{"$error":"#N/A"},"Zeile 19",2]
["Artikelnummer korrekt?","part numer correct?","Code article correct?","Numero articolo giusto?","onderdeel nummer juist?","Korrekt varenummer?",null,null,31,null,null,null,null,"Zeile 20",{"$error":"#N/A"},"Zeile 20",{"$error":"#N/A"}]
["Download Bestellhilfe","Download of the ordering guide","Téléchargement Guide de commande","Scaricamento del Guida all'ordinazione di Smart Handle","Download Bestelhulp Digitale SmartHandle","Download bestillingsvejledning",null,null,32,null,null,null,null,"Zeile 21",{"$error":"#N/A"},"Zeile 21",{"$error":"#N/A"}]
["*** Bitte Makros aktivieren ***","*** Please enable macros ***","*** S'il vous plaît activer les macros ***","*** Si prega di abilitare le macro ***","*** Schakel macro's ***","*** Aktiver venligst makroer ***",null,null,33,{"$f":"HLOOKUP('Hauptseite - main page'!G3,SI_Programming_Gateways!A158:F190,33,0)","v":"*** Aktiver venligst makroer ***"},null,null,null,"Zeile 22",{"$error":"#N/A"},"Zeile 22",{"$error":"#N/A"}]
["zum Produkt:","about the product:","voir le produit:","vai al prodotto:","product bekijken:","om produktet:",null,null,34,null,null,null,null,"Zeile 23",{"$error":"#N/A"},"Zeile 23",{"$error":"#N/A"}]
["http://www.smartintego.com/de/home/produkte/digitales-smart-handle-si/","http://www.smartintego.com/int/home/products/digital-smart-handle-si/","http://www.smartintego.com/int/home/products/digital-smart-handle-si/","http://www.smartintego.com/int/home/products/digital-smart-handle-si/","http://www.smartintego.com/int/home/products/digital-smart-handle-si/","http://www.smartintego.com/int/home/products/digital-smart-handle-si/",null,null,35,null,null,null,null,"Zeile 24",{"$error":"#N/A"},"Zeile 24",{"$error":"#N/A"}]
["Digitales SmartHandle SI","Digital SmartHandle SI","Digital SmartHandle SI","Digital SmartHandle SI","Digital SmartHandle SI","Digital SmartHandle / Langskilt SI (engelsk)",null,null,36,null,null,null,null,"Zeile 25",{"$error":"#N/A"},"Zeile 25",{"$error":"#N/A"}]
["http://www.smartintego.com/fileadmin/SmartIntego/PDFs/Produktkatalog_SmartIntego_DE.pdf","http://www.smartintego.com/fileadmin/SmartIntego/PDFs/Productcatalogue%20_SmartIntego_EN.pdf","http://www.smartintego.com/fileadmin/SmartIntego/PDFs/Productcatalogue%20_SmartIntego_EN.pdf","http://www.smartintego.com/fileadmin/SmartIntego/PDFs/Productcatalogue%20_SmartIntego_EN.pdf","http://www.smartintego.com/fileadmin/SmartIntego/PDFs/Productcatalogue%20_SmartIntego_EN.pdf","http://www.smartintego.com/fileadmin/SmartIntego/PDFs/Productcatalogue%20_SmartIntego_EN.pdf",null,null,37,null,null,null,null,"Zeile 26",{"$error":"#N/A"},"Zeile 26",{"$error":"#N/A"}]
["Produktkatalog SmartIntego","Product Catalogue SmartIntego","Product Catalogue SmartIntego","Product Catalogue SmartIntego","Product Catalogue SmartIntego","Produktkatalog SmartIntego (engelsk)",null,null,38,null,null,null,null,"Zeile 27",{"$error":"#N/A"},"Zeile 27",{"$error":"#N/A"}]
["http://www.smartintego.com/fileadmin/SmartIntego/PDFs/Broschuere_SmartIntego_DE.pdf","http://www.smartintego.com/fileadmin/SmartIntego/PDFs/Brochure_SmartIntego_UK.pdf","http://www.smartintego.com/fileadmin/SmartIntego/PDFs/Brochure_SmartIntego_UK.pdf","http://www.smartintego.com/fileadmin/SmartIntego/PDFs/Brochure_SmartIntego_UK.pdf","http://www.smartintego.com/fileadmin/SmartIntego/PDFs/Brochure_SmartIntego_UK.pdf","http://www.smartintego.com/fileadmin/SmartIntego/PDFs/Brochure_SmartIntego_UK.pdf",null,null,39,null,null,null,null,"Zeile 28",{"$error":"#N/A"},"Zeile 28",{"$error":"#N/A"}]
["Broschüre SmartIntego","Brochure SmartIntego","Brochure SmartIntego","Brochure SmartIntego","Brochure SmartIntego","Brochure SmartIntego",null,null,40,null,null,null,null,"Zeile 29",{"$error":"#N/A"},"Zeile 29",{"$error":"#N/A"}]
["Bemerkungen","Comments","Remarque","Note","Beperkingen","Bemærkninger",null,null,41,null,null,null,null,"Zeile 30",{"$error":"#N/A"},"Zeile 30",{"$error":"#N/A"}]
["Programmiergerät SmartIntego","programming device SmartIntego","programming device SmartIntego","programming device SmartIntego","programming device SmartIntego","Konfigurationsenhed SmartIntego",null,null,42,null,null,null,null,"Zeile 31",{"$error":"#N/A"},"Zeile 31",{"$error":"#N/A"}]
["Programmiersoftware SmartIntego","programming software SmartIntego","programming software SmartIntego","programming software SmartIntego","programming software SmartIntego","Konfigurationssoftware SmartIntego",null,null,43,null,null,null,null,"Zeile 32",{"$error":"#N/A"},"Zeile 32",{"$error":"#N/A"}]
["Programmierung (Hardware & Software)","programming (hardware & software)","programming (hardware & software)","programming (hardware & software)","programming (hardware & software)","Konfiguration (hardware & software)",null,null,44,null,null,null,null,"Zeile 33",{"$error":"#N/A"},"Zeile 33",{"$error":"#N/A"}]
["Artikelbeschreibung","item description","item description","item description","item description","Produktbeskrivelse",null,null,45,null,null,null,null,"Zeile 34",{"$error":"#N/A"},"Zeile 34",{"$error":"#N/A"}]
["Artikelnummer  ","part number ","part number ","part number ","part number ","Varenummer",null,null,46]
[null,null,null,null,null,null,null,null,47]
[null,null,null,null,null,null,null,null,48]
[null,null,null,null,null,null,null,null,49]
["Scandinavian Oval","Scandinavian Oval","Ovale scandinave","Scandinavian Oval","Scandinavian Oval","Skandinavisk Oval",null,null,50]
["http://www.smartintego.com/de/home/infocenter/downloads/","http://www.smartintego.com/int/home/infocenter/downloads/","http://www.smartintego.com/int/home/infocenter/downloads/","http://www.smartintego.com/int/home/infocenter/downloads/","http://www.smartintego.com/int/home/infocenter/downloads/","http://www.smartintego.com/int/home/infocenter/downloads/",null,null,51]
["Standard SmartHandle (ohne Door Monitoring)","Standard SmartHandle (without Door Monitoring)","SmartHandle standard (sans Door Monitoring)","SmartHandle standard (Senza DoorMonitoring)","Standaard SmartHandle (zonder deurstand signalering)","Standard SmartHandle (uden dør monitorering)",null,null,52]
["Door Monitoring (SV Sensorik)","Door Monitoring  (SV sensors)","Door Monitoring (capteurs SV)","Door Monitoring (sensore SV)","Deurstand signalering (interne SV)","Dør monitorering (SV sensorer)",null,null,53]
["Door Monitoring (Schlosssensorik)","Door Monitoring (lock sensors)","Door monitoring (capteur de serrure)",null,"Deurstand signalering (slot sensors)","Dørmonitorering",null,null,54]
["Door Monitoring (Drückersensorik)","Door Monitoring (handle sensor)","Door monitoring (capteur poignée)","Door Monitoring (sensore sulla leva)","Deurstand signalering (kruk sensor)","Dør monitorering (dørgrebs sensor)",null,null,55]
["SmartHandle Typ","type of SmartHandle","type de SmartHandle","Tipo di SmartHandle","SmartHandle uitvoering","SmartHandle type",null,null,56]
["ACHTUNG: Das WaveNet LockNode ist fest integriert und kann nicht gewechselt werden, dieses bitte immer mitbestellen",null,null,null,null,null,null,null,57]
["Î","P",null,null,null,null,null,null,58,null,null,null,null,{"$f":"IF($I$3=\"Deutsch\",$A182,IF($I$3=\"English\",$B182,IF($I$3=\"Français\",$C182,IF($I$3=\"Italiano\",$D182,IF($I$3=\"Nederlands\",$E182,IF($I$3=\"Dansk\",$F182,\"\"))))))","v":"Europrofil uden udstandsning til låsecylinder"},1,null,null,1,2]
["ACHTUNG bei Bestellungen von Door Monitoring SmartHandles mit interner oder externer Sensorik: \nDas WaveNet LockNode ist fest integriert und kann nicht gewechselt werden!","Please note for orders with internal or external sensors:\nThe Lock Node is already included and cannot be changed.","Please note for orders with internal or external sensors:\nThe Lock Node is already included and cannot be changed.","Please note for orders with internal or external sensors:\nThe Lock Node is already included and cannot be changed.","Please note for orders with internal or external sensors:\nThe Lock Node is already included and cannot be changed.",null,null,null,59,null,null,null,null,"Schweizisk Rund uden udstandsning til låsecylinder",1,null,null,1,1]
["Zusatzinformation","additional information","informations complémentaires","Informazioni aggiuntive","Extra informatie","Yderligere information",null,null,60,{"$f":"HLOOKUP('Hauptseite - main page'!G3,SI_Programming_Gateways!A158:F217,60,0)","v":"Yderligere information"},null,null,null,"Skandinavisk Oval uden udstandsning til låsecylinder",1,null,null,3]
["siehe Bemerkung unten","see comment below","voir remarques ci-après","Vedere i commenti in calce","Zie onderstaande opmerking","se nedenstående kommentar",null,null,61,null,null,null,null,"Europrofil med udstandsning til låsecylinder",1]
["Europrofil mit MO - Rosettenmontage (mit Adapterplatten)","Europrofile with MO - rose mounting (with adapter plates)","profil européen avec MO - montage de rosette",null,"Dråbecylinder med MO",null,null,null,62,null,null,null,null,"Schweizisk Rund med udstandsning til låsecylinder",1]
["Wireless Online / Virtual CardNetwork","Wireless Online / Virtual CardNetwork","Wireless Online / Virtual CardNetwork","Wireless Online / Virtual CardNetwork","Wireless Online / Virtual CardNetwork","Wireless Online / Virtual CardNetwork",null,null,63,null,null,null,null,"Skandinavisk Oval med udstandsning til låsecylinder",1]
["Wireless Online","Wireless Online","Wireless Online","Wireless Online","Wireless Online","Wireless Online",null,null,64,null,null,null,null,{"$f":"IF($I$3=\"Deutsch\",$A219,IF($I$3=\"English\",$B219,IF($I$3=\"Français\",$C219,IF($I$3=\"Italiano\",$D219,IF($I$3=\"Nederlands\",$E219,IF($I$3=\"Dansk\",$F219,\"\"))))))","v":0},2]
["Virtual CardNetwork","Virtual CardNetwork","Virtual CardNetwork","Virtual CardNetwork","Virtual CardNetwork","Virtual CardNetwork",null,null,65,null,null,null,null,{"$f":"IF($I$3=\"Deutsch\",$A237,IF($I$3=\"English\",$B237,IF($I$3=\"Français\",$C237,IF($I$3=\"Italiano\",$D237,IF($I$3=\"Nederlands\",$E237,IF($I$3=\"Dansk\",$F237,\"\"))))))","v":"noch zu übersetzen"},2]
["SmartIntego GatewayNode zur Umsetzung von der RS 485 Schnittstelle auf 868 MHz","SmartIntego GatewayNode to convert from RS485 port to 868 MHz","SmartIntego GatewayNode to convert from RS485 port to 868 MHz","SmartIntego GatewayNode to convert from RS485 port to 868 MHz","SmartIntego GatewayNode to convert from RS485 port to 868 MHz","SmartIntego GatewayNode til konvertering fra RS485 port til 868 MHz",null,null,67,null,null,null,null,{"$f":"IF($I$3=\"Deutsch\",$A238,IF($I$3=\"English\",$B238,IF($I$3=\"Français\",$C238,IF($I$3=\"Italiano\",$D238,IF($I$3=\"Nederlands\",$E238,IF($I$3=\"Dansk\",$F238,\"\"))))))","v":"noch zu übersetzen"},2]
["SmartIntego GatewayNode zur Umsetzung von Ethernet (TCP/IP) auf 868 MHz","SmartIntego GatewayNode to convert from Ethernet (TCP/IP) to 868 MHz","SmartIntego GatewayNode to convert from Ethernet (TCP/IP) to 868 MHz","SmartIntego GatewayNode to convert from Ethernet (TCP/IP) to 868 MHz","SmartIntego GatewayNode to convert from Ethernet (TCP/IP) to 868 MHz","SmartIntego GatewayNode til konvertering fra Ethernet (TCP/IP) til 868 MHz",null,null,68,null,null,null,null,{"$f":"IF($I$3=\"Deutsch\",$A239,IF($I$3=\"English\",$B239,IF($I$3=\"Français\",$C239,IF($I$3=\"Italiano\",$D239,IF($I$3=\"Nederlands\",$E239,IF($I$3=\"Dansk\",$F239,\"\"))))))","v":"noch zu übersetzen"},2]
["SmartIntego GatewayNode zur Reichweitenverlängerung der 868 MHz Funkstrecke ","SmartIntego GatewayNode to extend range of 868 MHz transmission path","SmartIntego GatewayNode to extend range of 868 MHz transmission path","SmartIntego GatewayNode to extend range of 868 MHz transmission path","SmartIntego GatewayNode to extend range of 868 MHz transmission path","SmartIntego GatewayNode til at udvide rækkevidden af 868 MHz radioforbindelse",null,null,69]
["SmartIntego GatewayNode mit Ethernet - Mercury","SmartIntego GatewayNode with Ethernet - Mercury","SmartIntego GatewayNode avec Ethernet - Mercury",null,"SmartIntego GatewayNode met Ethernet - Mercury","SmartIntego GatewayNode med Ethernet - Mercury",null,null,70]
["Listenpreis","list price","list price","list price","list price","list price",null,null,71]
["Währung","currency","currency","currency","currency","currency",null,null,72]
["Listenpreis (für UK-Kunden)","list price (for UK customers)","list price (for UK customers)","list price (for UK customers)","list price (for UK customers)","list price (for UK customers)",null,null,73]
["*** Bitte beachten Sie, dass der angezeigte Listenpreis aufgrund von Kursschwankungen minimale Differenzen aufweisen kann ***","*** Please note that the list price shown above can be slightly different to the price as per our system as a result of exchange rate differences ***","*** Please note that the list price shown above can be slightly different to the price as per our system as a result of exchange rate differences ***","*** Please note that the list price shown above can be slightly different to the price as per our system as a result of exchange rate differences ***","*** Please note that the list price shown above can be slightly different to the price as per our system as a result of exchange rate differences ***",null,null,null,74,null,null,null,null,"Zeile 18",{"$f":"VLOOKUP($D18,$N$215:$O$224,2,FALSE)","v":{"$error":"#N/A"}}]
[null,null,null,null,null,null,null,null,75,null,null,null,null,"Zeile 19",{"$error":"#N/A"}]
[null,null,null,null,null,null,null,null,76,null,null,null,null,"Zeile 20",2]
["abweichende Lieferanschrift","delivery address ","noch zu übersetzen","noch zu übersetzen","noch zu übersetzen","noch zu übersetzen",null,null,77,null,null,null,null,"Zeile 21",2]
["Beschreibung","description","noch zu übersetzen","noch zu übersetzen","noch zu übersetzen","noch zu übersetzen",null,null,78,{"$f":"HLOOKUP('Hauptseite - main page'!$G$3,$A$158:F241,77,0)","v":"noch zu übersetzen"},null,null,null,"Zeile 22",2]
["zurück zur Hauptseite","back to main page","noch zu übersetzen","noch zu übersetzen","noch zu übersetzen","noch zu übersetzen",null,null,79,{"$f":"HLOOKUP('Hauptseite - main page'!$G$3,A158:F241,78,0)","v":"noch zu übersetzen"},null,null,null,"Zeile 23",2]
["Zusammenfassung der Bestellung","order summary","noch zu übersetzen","noch zu übersetzen","noch zu übersetzen","noch zu übersetzen",null,null,80,null,null,null,null,"Zeile 24",2]
["Swiss Round mit MO - Rosettenmontage (mit Adapterplatten)","Swiss Round with MO - rose mounting (with adapter plates)","noch zu übersetzen","noch zu übersetzen","noch zu übersetzen","noch zu übersetzen",null,null,81,null,null,null,null,"Zeile 25",2]
["Europrofil mit MO - Rohrramentüren (mit Adapterplatten)","Europrofile with MO - glass doors (with adapter plates)","noch zu übersetzen","noch zu übersetzen","noch zu übersetzen","noch zu übersetzen",null,null,82,null,null,null,null,"Zeile 26",2]
["Swiss Round mit MO - Rohrrahmentüren (mit Adapterplatten)","Swiss Round with MO - glass doors (with adapter plates)","noch zu übersetzen","noch zu übersetzen","noch zu übersetzen","noch zu übersetzen",null,null,83,null,null,null,null,"Zeile 27",2]
["kurzer Bestellcode","short order code",null,null,null,null,null,null,84,{"$f":"HLOOKUP('Hauptseite - main page'!$G$3,$A$158:F241,83,0)","v":0},null,null,null,"Zeile 28",2]
["Bestellcode wird nach Prüfung nachgereicht","short order code will be submitted after verification",null,null,null,null,null,null,85,{"$f":"HLOOKUP('Hauptseite - main page'!$G$3,$A$158:F242,84,0)","v":0},null,null,null,"Zeile 29",2]
["SI Wireless Node für I/O-Anwendungen","SI Wireless node for I/O applications",null,null,null,null,null,null,86,{"$f":"HLOOKUP('Hauptseite - main page'!$G$3,$A$158:F243,85,0)","v":0},null,null,null,"Zeile 30",2]
["Mindestens eine der angegebenen Artikelnummern ist nicht korrekt.\n\nBitte korrigieren.","At least one of the selected item numbers is not correct.\n\nPlease correct your input.","Au moins un des numéros d’articles saisis est incorrect.\n\nVeuillez corriger.","Almeno uno dei codici articolo indicati è errato.\n\nCorreggere.","Minstens een van de vermelde artikelnummers is niet correct.\n\nCorrigeer dit alstublieft.","Mindst et af de anførte varenumre er ikke korrekt.\n\nKorriger det venligst.","Minst ett av de angivna artikelnumren är felaktigt.\n\nVar vänlig rätta till.",null,87,{"$f":"HLOOKUP('Hauptseite - main page'!$G$3,$A$158:F244,86,0)","v":"Mindst et af de anførte varenumre er ikke korrekt.\n\nKorriger det venligst."},null,null,null,"Zeile 31",2]
["Zuordnung: langer Bestellcode <--> kurze Bestellnummer (OF-Nr.)","allocation: long order code <--> short oder code (OF-No.)","noch zu übersetzen","noch zu übersetzen","noch zu übersetzen","noch zu übersetzen",null,null,88,{"$f":"HLOOKUP('Hauptseite - main page'!$G$3,$A$158:F245,87,0)","v":"noch zu übersetzen"},null,null,null,"Zeile 32",2]
["Messing","brass","Laiton","ottone","Messing","Messing","Mässing",null,89,{"$f":"HLOOKUP('Hauptseite - main page'!$G$3,$A$158:F246,88,0)","v":"Messing"},null,null,null,"Zeile 33",2]
[null,null,null,null,null,null,null,null,90,null,null,null,null,"Zeile 34",2]
[null,null,null,null,null,null,null,null,91]
[null,null,null,null,null,null,null,null,92]
[null,null,null,null,null,null,null,null,93]
[null,null,null,null,null,null,null,null,94]
[null,null,null,null,null,null,null,null,95]
[null,null,null,null,null,null,null,null,96]
[null,null,null,null,null,null,null,null,97]
[null,null,null,null,null,null,null,null,98]
[null,null,null,null,null,null,null,null,99]
[null,null,null,null,null,null,null,null,100]
[null,null,null,null,null,null,null,null,101]
[null,null,null,null,null,null,null,null,102]
[null,null,null,null,null,null,null,null,103]
[null,null,null,null,null,null,null,null,104]
[null,null,null,null,null,null,null,null,105]
[null,null,null,null,null,null,null,null,106]
[null,null,null,null,null,null,null,null,107]
[null,null,null,null,null,null,null,null,108]
[null,null,null,null,null,null,null,null,109]
[null,null,null,null,null,null,null,null,110]
[null,null,null,null,null,null,null,null,111]
[null,null,null,null,null,null,null,null,112]
[null,null,null,null,null,null,null,null,113]
[null,null,null,null,null,null,null,null,114]
[null,null,null,null,null,null,null,null,115]
[null,null,null,null,null,null,null,null,116]
[null,null,null,null,null,null,null,null,117]
[null,null,null,null,null,null,null,null,118]
[null,null,null,null,null,null,null,null,119]
[null,null,null,null,null,null,null,null,120]
[null,null,null,null,null,null,null,null,121]
[null,null,null,null,null,null,null,null,122]
[null,null,null,null,null,null,null,null,123]
[null,null,null,null,null,null,null,null,124]
[null,null,null,null,null,null,null,null,125]
[null,null,null,null,null,null,null,null,126]
[null,null,null,null,null,null,null,null,127]
[null,null,null,null,null,null,null,null,128]
[null,null,null,null,null,null,null,null,129]
[null,null,null,null,null,null,null,null,130]
[null,null,null,null,null,null,null,null,131]
[null,null,null,null,null,null,null,null,132]
[null,null,null,null,null,null,null,null,133]
[null,null,null,null,null,null,null,null,134]
[null,null,null,null,null,null,null,null,135]
[null,null,null,null,null,null,null,null,136]
[null,null,null,null,null,null,null,null,137]
[null,null,null,null,null,null,null,null,138]
[null,null,null,null,null,null,null,null,139]
[null,null,null,null,null,null,null,null,140]
[null,null,null,null,null,null,null,null,141]
[null,null,null,null,null,null,null,null,142]
[null,null,null,null,null,null,null,null,143]
[null,null,null,null,null,null,null,null,144]
[null,null,null,null,null,null,null,null,145]
[null,null,null,null,null,null,null,null,146]
[null,null,null,null,null,null,null,null,147]
[null,null,null,null,null,null,null,null,148]
[null,null,null,null,null,null,null,null,149]
[null,null,null,null,null,null,null,null,150]
[null,null,null,null,null,null,null,null,151]
[null,null,null,null,null,null,null,null,152]
[null,null,null,null,null,null,null,null,153]
[null,null,null,null,null,null,null,null,154]
[null,null,null,null,null,null,null,null,155]
[null,null,null,null,null,null,null,null,156]
[null,null,null,null,null,null,null,null,157]
[null,null,null,null,null,null,null,null,158]
[null,null,null,null,null,null,null,null,159]
[null,null,null,null,null,null,null,null,160]
[null,null,null,null,null,null,null,null,161]
[null,null,null,null,null,null,null,null,162]
[null,null,null,null,null,null,null,null,163]
[null,null,null,null,null,null,null,null,164]
[null,null,null,null,null,null,null,null,165]
[null,null,null,null,null,null,null,null,166]
[null,null,null,null,null,null,null,null,167]
[null,null,null,null,null,null,null,null,168]
[null,null,null,null,null,null,null,null,169]
[null,null,null,null,null,null,null,null,170]
[null,null,null,null,null,null,null,null,171]
[null,null,null,null,null,null,null,null,172]
[null,null,null,null,null,null,null,null,173]
[null,null,null,null,null,null,null,null,174]
[null,null,null,null,null,null,null,null,175]
[null,null,null,null,null,null,null,null,176]
[null,null,null,null,null,null,null,null,177]
[null,null,null,null,null,null,null,null,178]
[null,null,null,null,null,null,null,null,179]
[null,null,null,null,null,null,null,null,180]
[null,null,null,null,null,null,null,null,181]
[null,null,null,null,null,null,null,null,182]
[null,null,null,null,null,null,null,null,183]
[null,null,null,null,null,null,null,null,184]
[null,null,null,null,null,null,null,null,185]
[null,null,null,null,null,null,null,null,186]
[null,null,null,null,null,null,null,null,187]
[null,null,null,null,null,null,null,null,188]
[null,null,null,null,null,null,null,null,189]
[null,null,null,null,null,null,null,null,190]
[null,null,null,null,null,null,null,null,191]
[null,null,null,null,null,null,null,null,192]
[null,null,null,null,null,null,null,null,193]
[null,null,null,null,null,null,null,null,194]
[null,null,null,null,null,null,null,null,195]
[null,null,null,null,null,null,null,null,196]
[null,null,null,null,null,null,null,null,197]
[null,null,null,null,null,null,null,null,198]
[null,null,null,null,null,null,null,null,199]
[null,null,null,null,null,null,null,null,200]
[null,null,null,null,null,null,null,null,201]
[null,null,null,null,null,null,null,null,202]
[null,null,null,null,null,null,null,null,203]
[null,null,null,null,null,null,null,null,204]
[null,null,null,null,null,null,null,null,205]
[null,null,null,null,null,null,null,null,206]
[null,null,null,null,null,null,null,null,207]
[null,null,null,null,null,null,null,null,208]
[null,null,null,null,null,null,null,null,209]
[null,null,null,null,null,null,null,null,210]
[null,null,null,null,null,null,null,null,211]
[null,null,null,null,null,null,null,null,212]
[null,null,null,null,null,null,null,null,213]
[null,null,null,null,null,null,null,null,214]
[null,null,null,null,null,null,null,null,215]
[null,null,null,null,null,null,null,null,216]
[null,null,null,null,null,null,null,null,217]
[null,null,null,null,null,null,null,null,218]
[null,null,null,null,null,null,null,null,219]
[null,null,null,null,null,null,null,null,220]
[null,null,null,null,null,null,null,null,221]
[null,null,null,null,null,null,null,null,222]
[null,null,null,null,null,null,null,null,223]
[null,null,null,null,null,null,null,null,224]
[null,null,null,null,null,null,null,null,225]
[null,null,null,null,null,null,null,null,226]
[null,null,null,null,null,null,null,null,227]
[null,null,null,null,null,null,null,null,228]
[null,null,null,null,null,null,null,null,229]
[null,null,null,null,null,null,null,null,230]
[null,null,null,null,null,null,null,null,231]
[null,null,null,null,null,null,null,null,232]
[null,null,null,null,null,null,null,null,233]
[null,null,null,null,null,null,null,null,234]
[null,null,null,null,null,null,null,null,235]
[null,null,null,null,null,null,null,null,236]
[null,null,null,null,null,null,null,null,237]
[null,null,null,null,null,null,null,null,238]
[null,null,null,null,null,null,null,null,239]
[null,null,null,null,null,null,null,null,240]
[null,null,null,null,null,null,null,null,241]
[null,null,null,null,null,null,null,null,242]
[null,null,null,null,null,null,null,null,243]
[null,null,null,null,null,null,null,null,244]
[null,null,null,null,null,null,null,null,245]
[null,null,null,null,null,null,null,null,246]
[null,null,null,null,null,null,null,null,247]
[null,null,null,null,null,null,null,null,248]
[null,null,null,null,null,null,null,null,249]
[null,null,null,null,null,null,null,null,250]
[null,null,null,null,null,null,null,null,251]
[null,null,null,null,null,null,null,null,252]
[null,null,null,null,null,null,null,null,253]
[null,null,null,null,null,null,null,null,254]
[null,null,null,null,null,null,null,null,255]
[null,null,null,null,null,null,null,null,256]
[null,null,null,null,null,null,null,null,257]
[null,null,null,null,null,null,null,null,258]
[null,null,null,null,null,null,null,null,259]
[null,null,null,null,null,null,null,null,260]
[null,null,null,null,null,null,null,null,261]
[null,null,null,null,null,null,null,null,262]
[null,null,null,null,null,null,null,null,263]
[null,null,null,null,null,null,null,null,264]
[null,null,null,null,null,null,null,null,265]
[null,null,null,null,null,null,null,null,266]
[null,null,null,null,null,null,null,null,267]
[null,null,null,null,null,null,null,null,268]
[null,null,null,null,null,null,null,null,269]
[null,null,null,null,null,null,null,null,270]
[null,null,null,null,null,null,null,null,271]
[null,null,null,null,null,null,null,null,272]
[null,null,null,null,null,null,null,null,273]
[null,null,null,null,null,null,null,null,274]
[null,null,null,null,null,null,null,null,275]
[null,null,null,null,null,null,null,null,276]
[null,null,null,null,null,null,null,null,277]
[null,null,null,null,null,null,null,null,278]
[null,null,null,null,null,null,null,null,279]
[null,null,null,null,null,null,null,null,280]
[null,null,null,null,null,null,null,null,281]
[null,null,null,null,null,null,null,null,282]
[null,null,null,null,null,null,null,null,283]
[null,null,null,null,null,null,null,null,284]
[null,null,null,null,null,null,null,null,285]
[null,null,null,null,null,null,null,null,286]
[null,null,null,null,null,null,null,null,287]
[null,null,null,null,null,null,null,null,288]
[null,null,null,null,null,null,null,null,289]
[null,null,null,null,null,null,null,null,290]
[null,null,null,null,null,null,null,null,291]
[null,null,null,null,null,null,null,null,292]
[null,null,null,null,null,null,null,null,293]
[null,null,null,null,null,null,null,null,294]
[null,null,null,null,null,null,null,null,295]
[null,null,null,null,null,null,null,null,296]
[null,null,null,null,null,null,null,null,297]
[null,null,null,null,null,null,null,null,298]
[null,null,null,null,null,null,null,null,299]
[null,null,null,null,null,null,null,null,300]
[null,null,null,null,null,null,null,null,301]
[null,null,null,null,null,null,null,null,302]
[null,null,null,null,null,null,null,null,303]
[null,null,null,null,null,null,null,null,304]
[null,null,null,null,null,null,null,null,305]
[null,null,null,null,null,null,null,null,306]
[null,null,null,null,null,null,null,null,307]
[null,null,null,null,null,null,null,null,308]
[null,null,null,null,null,null,null,null,309]
[null,null,null,null,null,null,null,null,310]
[null,null,null,null,null,null,null,null,311]
[null,null,null,null,null,null,null,null,312]
[null,null,null,null,null,null,null,null,313]
[null,null,null,null,null,null,null,null,314]
[null,null,null,null,null,null,null,null,315]
[null,null,null,null,null,null,null,null,316]
[null,null,null,null,null,null,null,null,317]
[null,null,null,null,null,null,null,null,318]
[null,null,null,null,null,null,null,null,319]
[null,null,null,null,null,null,null,null,320]
[null,null,null,null,null,null,null,null,321]
[null,null,null,null,null,null,null,null,322]
[null,null,null,null,null,null,null,null,323]
[null,null,null,null,null,null,null,null,324]
[null,null,null,null,null,null,null,null,325]
[null,null,null,null,null,null,null,null,326]
[null,null,null,null,null,null,null,null,327]
[null,null,null,null,null,null,null,null,328]
[null,null,null,null,null,null,null,null,329]
[null,null,null,null,null,null,null,null,330]
[null,null,null,null,null,null,null,null,331]
[null,null,null,null,null,null,null,null,332]
[null,null,null,null,null,null,null,null,333]
[null,null,null,null,null,null,null,null,334]
[null,null,null,null,null,null,null,null,335]
[null,null,null,null,null,null,null,null,336]
[null,null,null,null,null,null,null,null,337]
[null,null,null,null,null,null,null,null,338]
[null,null,null,null,null,null,null,null,339]
[null,null,null,null,null,null,null,null,340]
[null,null,null,null,null,null,null,null,341]
[null,null,null,null,null,null,null,null,342]
[null,null,null,null,null,null,null,null,343]
[null,null,null,null,null,null,null,null,344]
[null,null,null,null,null,null,null,null,345]
[null,null,null,null,null,null,null,null,346]
[null,null,null,null,null,null,null,null,347]
[null,null,null,null,null,null,null,null,348]
[null,null,null,null,null,null,null,null,349]
[null,null,null,null,null,null,null,null,350]
[null,null,null,null,null,null,null,null,351]
[null,null,null,null,null,null,null,null,352]
[null,null,null,null,null,null,null,null,353]
[null,null,null,null,null,null,null,null,354]
[null,null,null,null,null,null,null,null,355]
[null,null,null,null,null,null,null,null,356]
[null,null,null,null,null,null,null,null,357]
[null,null,null,null,null,null,null,null,358]
[null,null,null,null,null,null,null,null,359]
[null,null,null,null,null,null,null,null,360]
[null,null,null,null,null,null,null,null,361]
[null,null,null,null,null,null,null,null,362]
[null,null,null,null,null,null,null,null,363]
[null,null,null,null,null,null,null,null,364]
[null,null,null,null,null,null,null,null,365]
[null,null,null,null,null,null,null,null,366]
[null,null,null,null,null,null,null,null,367]
[null,null,null,null,null,null,null,null,368]
[null,null,null,null,null,null,null,null,369]
[null,null,null,null,null,null,null,null,370]
[null,null,null,null,null,null,null,null,371]
[null,null,null,null,null,null,null,null,372]
[null,null,null,null,null,null,null,null,373]
[null,null,null,null,null,null,null,null,374]
[null,null,null,null,null,null,null,null,375]
[null,null,null,null,null,null,null,null,376]
[null,null,null,null,null,null,null,null,377]
[null,null,null,null,null,null,null,null,378]
[null,null,null,null,null,null,null,null,379]
[null,null,null,null,null,null,null,null,380]
[null,null,null,null,null,null,null,null,381]
[null,null,null,null,null,null,null,null,382]
[null,null,null,null,null,null,null,null,383]
[null,null,null,null,null,null,null,null,384]
[null,null,null,null,null,null,null,null,385]
[null,null,null,null,null,null,null,null,386]
[null,null,null,null,null,null,null,null,387]
[null,null,null,null,null,null,null,null,388]
[null,null,null,null,null,null,null,null,389]
[null,null,null,null,null,null,null,null,390]
[null,null,null,null,null,null,null,null,391]
[null,null,null,null,null,null,null,null,392]
[null,null,null,null,null,null,null,null,393]
[null,null,null,null,null,null,null,null,394]
[null,null,null,null,null,null,null,null,395]
[null,null,null,null,null,null,null,null,396]
[null,null,null,null,null,null,null,null,397]
[null,null,null,null,null,null,null,null,398]
[null,null,null,null,null,null,null,null,399]
[null,null,null,null,null,null,null,null,400]
[null,null,null,null,null,null,null,null,401]
[null,null,null,null,null,null,null,null,402]
[null,null,null,null,null,null,null,null,403]
[null,null,null,null,null,null,null,null,404]
[null,null,null,null,null,null,null,null,405]
[null,null,null,null,null,null,null,null,406]
[null,null,null,null,null,null,null,null,407]
[null,null,null,null,null,null,null,null,408]
[null,null,null,null,null,null,null,null,409]
[null,null,null,null,null,null,null,null,410]
[null,null,null,null,null,null,null,null,411]
[null,null,null,null,null,null,null,null,412]
[null,null,null,null,null,null,null,null,413]
[null,null,null,null,null,null,null,null,414]
[null,null,null,null,null,null,null,null,415]
[null,null,null,null,null,null,null,null,416]
[null,null,null,null,null,null,null,null,417]
[null,null,null,null,null,null,null,null,418]
[null,null,null,null,null,null,null,null,419]
[null,null,null,null,null,null,null,null,420]
[null,null,null,null,null,null,null,null,421]
[null,null,null,null,null,null,null,null,422]
[null,null,null,null,null,null,null,null,423]
[null,null,null,null,null,null,null,null,424]
[null,null,null,null,null,null,null,null,425]
[null,null,null,null,null,null,null,null,426]
[null,null,null,null,null,null,null,null,427]
[null,null,null,null,null,null,null,null,428]
[null,null,null,null,null,null,null,null,429]
[null,null,null,null,null,null,null,null,430]
[null,null,null,null,null,null,null,null,431]
[null,null,null,null,null,null,null,null,432]
[null,null,null,null,null,null,null,null,433]
[null,null,null,null,null,null,null,null,434]
[null,null,null,null,null,null,null,null,435]
[null,null,null,null,null,null,null,null,436]
[null,null,null,null,null,null,null,null,437]
[null,null,null,null,null,null,null,null,438]
[null,null,null,null,null,null,null,null,439]
[null,null,null,null,null,null,null,null,440]
[null,null,null,null,null,null,null,null,441]
[null,null,null,null,null,null,null,null,442]
[null,null,null,null,null,null,null,null,443]
[null,null,null,null,null,null,null,null,444]
[null,null,null,null,null,null,null,null,445]
[null,null,null,null,null,null,null,null,446]
[null,null,null,null,null,null,null,null,447]
[null,null,null,null,null,null,null,null,448]
[null,null,null,null,null,null,null,null,449]
[null,null,null,null,null,null,null,null,450]
[null,null,null,null,null,null,null,null,451]
[null,null,null,null,null,null,null,null,452]
[null,null,null,null,null,null,null,null,453]
[null,null,null,null,null,null,null,null,454]
[null,null,null,null,null,null,null,null,455]
[null,null,null,null,null,null,null,null,456]
[null,null,null,null,null,null,null,null,457]
[null,null,null,null,null,null,null,null,458]
[null,null,null,null,null,null,null,null,459]
[null,null,null,null,null,null,null,null,460]
[null,null,null,null,null,null,null,null,461]
[null,null,null,null,null,null,null,null,462]
[null,null,null,null,null,null,null,null,463]
[null,null,null,null,null,null,null,null,464]
[null,null,null,null,null,null,null,null,465]
[null,null,null,null,null,null,null,null,466]
[null,null,null,null,null,null,null,null,467]
[null,null,null,null,null,null,null,null,468]
[null,null,null,null,null,null,null,null,469]
[null,null,null,null,null,null,null,null,470]
[null,null,null,null,null,null,null,null,471]
[null,null,null,null,null,null,null,null,472]
[null,null,null,null,null,null,null,null,473]
[null,null,null,null,null,null,null,null,474]
[null,null,null,null,null,null,null,null,475]
[null,null,null,null,null,null,null,null,476]
[null,null,null,null,null,null,null,null,477]
[null,null,null,null,null,null,null,null,478]
[null,null,null,null,null,null,null,null,479]
[null,null,null,null,null,null,null,null,480]
[null,null,null,null,null,null,null,null,481]
[null,null,null,null,null,null,null,null,482]
[null,null,null,null,null,null,null,null,483]
[null,null,null,null,null,null,null,null,484]
[null,null,null,null,null,null,null,null,485]
[null,null,null,null,null,null,null,null,486]
[null,null,null,null,null,null,null,null,487]
[null,null,null,null,null,null,null,null,488]
[null,null,null,null,null,null,null,null,489]
[null,null,null,null,null,null,null,null,490]
[null,null,null,null,null,null,null,null,491]
[null,null,null,null,null,null,null,null,492]
[null,null,null,null,null,null,null,null,493]
[null,null,null,null,null,null,null,null,494]
[null,null,null,null,null,null,null,null,495]
[null,null,null,null,null,null,null,null,496]
[null,null,null,null,null,null,null,null,497]
[null,null,null,null,null,null,null,null,498]
[null,null,null,null,null,null,null,null,499]
[null,null,null,null,null,null,null,null,500]

{"sheet":"SI_Zylinder","index":4,"n_rows":733,"n_cols":24,"rows_kept":733,"cut":false,"hidden":true,"merged":[[1,5,1,6],[3,5,3,6],[29,0,36,8],[4,7,4,8],[5,7,5,8],[13,3,13,4],[15,1,15,2],[18,1,18,2],[27,8,27,9]]}
[]
["SmartIntego"]
[{"$f":"HLOOKUP($O$16,A234:F254,14,0)","v":"Bestillingsvejledning til digitale låsecylindre"},null,null,null,null,{"$f":"'Hauptseite - main page'!G3","v":"Dansk"}]
[]
[]
[{"$f":"HLOOKUP($O$16,A234:F254,3,0)","v":"Låsecylinder type / varenummer"},{"$f":"IF(OR(A7=\"Scandinavian_Oval\",A7=\"Scandinavian_Round\"),\"\",HLOOKUP($O$16,A234:F257,23,0))","v":"Udvendig længde"},null,{"$f":"IF(OR(A7=\"Scandinavian_Oval\",A7=\"Scandinavian_Round\"),\"\",HLOOKUP($O$16,A234:F257,24,0))","v":"Indvendig længde"}]
["Europrofil"]
[null,{"$f":"HLOOKUP($F$3,A234:E257,22,0)","v":{"$error":"#N/A"}}]
[]
[]
[]
[null,{"$f":"HLOOKUP($O$16,A234:F257,22,0)","v":"Mål angives i mm"}]
[]
[{"$f":"HLOOKUP($O$16,A234:F254,10,0)","v":"Kundenavn"},null,null,{"$f":"HLOOKUP($O$16,A234:F254,9,0)","v":"Kundenummer"},null,null,null,{"$f":"HLOOKUP($O$16,A234:F254,13,0)","v":"Tillæg til ordrenummer"}]
[]
[{"$f":"HLOOKUP($O$16,A234:F254,12,0)","v":"Projektnavn"},null,null,null,null,null,null,{"$f":"HLOOKUP($O$16,A234:F254,11,0)","v":"Projektnummer"},null,null,null,null,null,null,{"$f":"'Hauptseite - main page'!G3","v":"Dansk"}]
[]
[null,null,null,null,null,null,null,null,null,null,null,null,null,null,"für Beschreibung in Zusammenfassung"]
[{"$f":"HLOOKUP($O$16,A234:F254,2,0)","v":"Antal"},{"$f":"HLOOKUP($O$16,A234:F254,3,0)","v":"Låsecylinder type / varenummer"},null,{"$f":"HLOOKUP($O$16,A234:F267,34,0)","v":"Wireless Online / Virtual CardNetwork"},{"$f":"HLOOKUP($O$16,A234:F254,4,0)","v":"Variant"},{"$f":"HLOOKUP($O$16,A234:F254,5,0)","v":"Valgmuligheder"},{"$f":"HLOOKUP($O$16,A234:F254,6,0)","v":"Udvendig længde"},{"$f":"HLOOKUP($O$16,A234:F254,7,0)","v":"Indvendig længde"},{"$f":"HLOOKUP($O$16,A234:F254,8,0)","v":"Komplet varenummer"},{"$f":"HLOOKUP($O$16,A234:F254,19,0)","v":"Korrekt varenummer?"},"Außenlänge","Innenlänge",null,null,"Profil","Länge","Online / Offline","Variante Hilfsspalte","Variante","Optionen","komplette Beschreibung"]
[null,null,{"$f":"IF(ISERROR(VLOOKUP(B20,$A$105:$B$108,2,FALSE)),\"\",VLOOKUP(B20,$A$105:$B$108,2,FALSE))","v":""},null,null,null,null,null,{"$f":"IF(AND(F20<>$H$289,F20<>$H$290),C20&M20&E20&F20,C20&M20&E20)","v":{"$error":"#N/A"}},{"$f":"IF(AND(OR($E20=\"I30\",$E20=\"A40.MI\",$E20=\"A40.M\"),AND($C20<>\"\",$A20<>\"\")),$B$231,IF(AND(OR($E20<>\"I30\",$E20<>\"A40.MI\",$E20<>\"A40.M\")*AND($A20<>\"\",$C20<>\"\",$G20<>\"\",$H20<>\"\")),$B$231,$A$231))","v":"Î"},{"$f":"IF(OR(G20=$H$290,G20=\"\"),\"\",G20)","v":{"$error":"#N/A"}},{"$error":"#N/A"},{"$f":"K20&L20","v":{"$error":"#N/A"}},null,{"$f":"IF(B20<>\"\",B20&\" \",\"\")","v":""},{"$f":"IF(M20<>\"\",\"(\"&M20&\")\"&\", \",\"\")","v":{"$error":"#N/A"}},{"$f":"IF(D20<>\"\",D20&\", \",\"\")","v":""},{"$f":"IF(E20<>\"\",VLOOKUP(E20,$E$128:$G$138,3,FALSE),\"\")","v":""},{"$f":"IF(R20=\"y\",VLOOKUP(E20,$E$128:$F$138,2,FALSE)&\", \",\"\")","v":""},{"$f":"IF(AND(F20<>\"\",F20<>$H$289,F20<>$H$290),VLOOKUP(F20,$E$160:$F$174,2,FALSE),\"\")","v":{"$error":"#N/A"}},{"$f":"O20&P20&Q20&S20&T20","v":{"$error":"#N/A"}},null,null,{"$f":"IF(AND(I20<>\"\",J20<>$B$231),1,0)","v":{"$error":"#N/A"}}]
[null,null,"",null,null,null,null,null,{"$f":"IF(AND(F21<>$H$289,F21<>$H$290),C21&M21&E21&F21,C21&M21&E21)","v":{"$error":"#N/A"}},"Î",{"$error":"#N/A"},{"$error":"#N/A"},{"$f":"K21&L21","v":{"$error":"#N/A"}},null,{"$f":"IF(B21<>\"\",B21&\" \",\"\")","v":""},{"$error":"#N/A"},{"$f":"IF(D21<>\"\",D21&\", \",\"\")","v":""},"","",{"$f":"IF(AND(F21<>\"\",F21<>$H$289,F21<>$H$290),VLOOKUP(F21,$E$160:$F$174,2,FALSE),\"\")","v":{"$error":"#N/A"}},{"$f":"O21&P21&Q21&S21&T21","v":{"$error":"#N/A"}},null,null,{"$error":"#N/A"}]
[null,null,"",null,null,null,null,null,{"$error":"#N/A"},"Î",{"$error":"#N/A"},{"$error":"#N/A"},{"$error":"#N/A"},null,"",{"$error":"#N/A"},"","","",{"$error":"#N/A"},{"$error":"#N/A"},null,null,{"$error":"#N/A"}]
[null,null,"",null,null,null,null,null,{"$error":"#N/A"},"Î",{"$error":"#N/A"},{"$error":"#N/A"},{"$error":"#N/A"},null,"",{"$error":"#N/A"},"","","",{"$error":"#N/A"},{"$error":"#N/A"},null,null,{"$error":"#N/A"}]
[null,null,"",null,null,null,null,null,{"$error":"#N/A"},"Î",{"$error":"#N/A"},{"$error":"#N/A"},{"$error":"#N/A"},null,"",{"$error":"#N/A"},"","","",{"$error":"#N/A"},{"$error":"#N/A"},null,null,{"$error":"#N/A"}]
[null,null,"",null,null,null,null,null,{"$error":"#N/A"},"Î",{"$error":"#N/A"},{"$error":"#N/A"},{"$error":"#N/A"},null,"",{"$error":"#N/A"},"","","",{"$error":"#N/A"},{"$error":"#N/A"},null,null,{"$error":"#N/A"}]
[null,null,"",null,null,null,null,null,{"$error":"#N/A"},"Î",{"$error":"#N/A"},{"$error":"#N/A"},{"$error":"#N/A"},null,"",{"$error":"#N/A"},"","","",{"$error":"#N/A"},{"$error":"#N/A"},null,null,{"$error":"#N/A"}]
[null,null,null,null,null,null,null,null,null,null,null,null,null,null,null,null,null,null,null,null,null,null,"Summe",{"$f":"SUM(X20:X26)","v":{"$error":"#N/A"}}]
[]
[{"$f":"HLOOKUP($F$3,A234:F265,32,0)","v":"Bemærkninger"}]
[]
[]
[]
[]
[]
[]
[]
[]
[]
[]
[null,null,"Optionen"]
[null,"Variante","MS","WP","MR","DK","SW"]
["SI.Z4.","MI.CO",null,null,null,null,null,1]
["SI.Z4.","MI.CO","X",null,null,null,null,1]
["SI.Z4.","MI.CO",null,"X",null,null,null,1]
["SI.Z4.","MI.CO","X","X",null,null,null,1]
["SI.Z4.","MI.FD",null,null,null,null,null,3]
["SI.Z4.","MI.FD","X",null,null,null,null,3]
["SI.Z4.","MI.FD",null,"X",null,null,null,3]
["SI.Z4.","MI.FD",null,null,"X",null,null,3]
["SI.Z4.","MI.FD","X",null,"X",null,null,3]
["SI.Z4.","MI.FD","X","X",null,null,null,3]
["SI.Z4.","MI.FD",null,"X","X",null,null,3]
["SI.Z4.","MI.FD","X","X","X",null,null,3]
["SI.Z4.","MI.AP2.FD",null,null,null,null,null,1]
["SI.Z4.","MI.AP2.FD","X",null,null,null,null,1]
["SI.Z4.","MI.AP2.FD",null,"X",null,null,null,1]
["SI.Z4.","MI.AP2.FD","X","X",null,null,null,1]
["SI.Z4.","MI.AP2.BL",null,null,null,null,null,1]
["SI.Z4.","MI.AP2.BL","X",null,null,null,null,1]
["SI.Z4.","MI.AP2.BL",null,"X",null,null,null,1]
["SI.Z4.","MI.AP2.BL","X","X",null,null,null,1]
["SI.Z4.","MI.HZ",null,null,null,null,null,4]
["SI.Z4.","MI.HZ","X",null,null,null,null,4]
["SI.Z4.","MI.HZ",null,"X",null,null,null,4]
["SI.Z4.","MI.HZ",null,null,"X",null,null,4]
["SI.Z4.","MI.HZ",null,null,null,"X",null,4]
["SI.Z4.","MI.HZ","X","X",null,null,null,4]
["SI.Z4.","MI.HZ","X",null,"X",null,null,4]
["SI.Z4.","MI.HZ","X",null,null,"X",null,4]
["SI.Z4.","MI.HZ",null,"X","X",null,null,4]
["SI.Z4.","MI.HZ",null,"X",null,"X",null,4]
["SI.Z4.","MI.HZ",null,null,"X","X",null,4]
["SI.Z4.","MI.HZ","X","X","X",null,null,4]
["SI.Z4.","MI.HZ","X","X",null,"X",null,4]
["SI.Z4.","MI.HZ",null,"X","X","X",null,4]
["SI.Z4.","MI.HZ","X",null,"X","X",null,4]
["SI.Z4.","MI.HZ","X","X","X","X",null,4]
["SI.Z4.","SO.A40.MI",null,null,null,null,null,1]
["SI.Z4.","SO.A40.MI","X",null,null,null,null,1]
["SI.Z4.","SO.A40.MI",null,"X",null,null,null,1]
["SI.Z4.","SO.A40.MI","X","X",null,null,null,1]
["SI.Z4.","SO.I30",null,null,null,null,null,6]
["SI.Z4.","RS.A40.MI",null,null,null,null,null,1]
["SI.Z4.","RS.A40.MI","X",null,null,null,null,1]
["SI.Z4.","RS.A40.MI",null,"X",null,null,null,1]
["SI.Z4.","RS.A40.MI","X","X",null,null,null,1]
["SI.Z4.","RS.I30",null,null,null,null,null,6]
["SI.Z4.SR","MI.CO",null,null,null,null,null,1]
["SI.Z4.SR","MI.CO","X",null,null,null,null,1]
["SI.Z4.SR","MI.CO",null,"X",null,null,null,1]
["SI.Z4.SR","MI.CO","X","X",null,null,null,1]
["SI.Z4.SR","MI.HZ",null,null,null,null,null,5]
["SI.Z4.SR","MI.HZ","X",null,null,null,null,5]
["SI.Z4.SR","MI.HZ",null,"X",null,null,null,5]
["SI.Z4.SR","MI.HZ",null,null,"X",null,null,5]
["SI.Z4.SR","MI.HZ","X",null,"X",null,null,5]
["SI.Z4.SR","MI.HZ","X","X",null,null,null,5]
["SI.Z4.SR","MI.HZ",null,"X","X",null,null,5]
["SI.Z4.SR","MI.HZ","X","X","X",null,null,5]
[]
[]
[]
[]
["Zylinderprofil"]
[{"$f":"IF($F$3=\"Deutsch\",$A248,IF($F$3=\"English\",$B248,IF($F$3=\"Français\",$C248,IF($F$3=\"Italiano\",$D248,IF($F$3=\"Nederlands\",$E248,IF($F$3=\"Dansk\",$F248,\"\"))))))","v":"Europrofil"},"SI.Z4."]
[{"$f":"IF($F$3=\"Deutsch\",$A249,IF($F$3=\"English\",$B249,IF($F$3=\"Français\",$C249,IF($F$3=\"Italiano\",$D249,IF($F$3=\"Nederlands\",$E249,IF($F$3=\"Dansk\",$F249,\"\"))))))","v":"Schweizisk Rund"},"SI.Z4.SR."]
[{"$f":"IF($F$3=\"Deutsch\",$A250,IF($F$3=\"English\",$B250,IF($F$3=\"Français\",$C250,IF($F$3=\"Italiano\",$D250,IF($F$3=\"Nederlands\",$E250,IF($F$3=\"Dansk\",$F250,\"\"))))))","v":"Skandinavisk Oval"},"SI.Z4.SO."]
[{"$f":"IF($F$3=\"Deutsch\",$A251,IF($F$3=\"English\",$B251,IF($F$3=\"Français\",$C251,IF($F$3=\"Italiano\",$D251,IF($F$3=\"Nederlands\",$E251,IF($F$3=\"Dansk\",$F251,\"\"))))))","v":"Skandinavisk Rund"},"SI.Z4.RS."]
[]
[]
[]
[]
[]
["Variante",null,null,null,1,2,3,4,5,6]
["SI.Z4.","MI.CO",1,null,"MI.CO","MI.CO","A40.MI","M.CO","M.CO","A40.M"]
["SI.Z4.","MI.FD",1,null,"MI.FD","MI.HZ","I30","M.AP2.FD","M.HZ","I30"]
["SI.Z4.","MI.AP2.FD",1,null,"MI.AP2.FD",null,null,"M.HZ"]
["SI.Z4.","MI.AP2.BL",1,null,"MI.AP2.BL"]
["SI.Z4.","MI.HZ",1,null,"MI.HZ"]
["SI.Z4.SO.","A40.MI",3]
["SI.Z4.SO.","I30",3]
["SI.Z4.RS.","A40.MI",3]
["SI.Z4.RS.","I30",3]
["SI.Z4.SR.","MI.CO",2]
["SI.Z4.SR.","MI.HZ",2]
[]
["Wireless online / Virtual Card Network"]
[null,"Wireless Online",0,null,"MI.CO",{"$f":"HLOOKUP($F$3,$A$234:$F$272,35,0)","v":"noch zu übersetzen"},{"$f":"IF(F128=\"\",\"x\",\"y\")","v":"y"}]
[null,"Virtual Card Network",3,null,"MI.FD",{"$f":"HLOOKUP($F$3,$A$234:$F$272,36,0)","v":"noch zu übersetzen"},{"$f":"IF(F129=\"\",\"x\",\"y\")","v":"y"}]
[null,null,null,null,"MI.AP2.FD",{"$f":"HLOOKUP($F$3,$A$234:$F$272,37,0)","v":"noch zu übersetzen"},"y"]
[null,"Zeile 20",{"$f":"VLOOKUP($C20,$A$115:$C$125,3,FALSE)+VLOOKUP($D20,$B$128:$C$129,2,FALSE)","v":{"$error":"#N/A"}},null,"MI.AP2.BL",{"$f":"HLOOKUP($F$3,$A$234:$F$272,38,0)","v":"noch zu übersetzen"},"y"]
[null,"Zeile 21",{"$error":"#N/A"},null,"MI.HZ",{"$f":"HLOOKUP($F$3,$A$234:$F$272,39,0)","v":"noch zu übersetzen"},"y"]
[null,"Zeile 22",{"$error":"#N/A"},null,"M.CO",{"$f":"HLOOKUP($F$3,$A$234:$F$272,35,0)","v":"noch zu übersetzen"},"y"]
[null,"Zeile 23",{"$error":"#N/A"},null,"M.AP2.FD",{"$f":"HLOOKUP($F$3,$A$234:$F$272,37,0)","v":"noch zu übersetzen"},"y"]
[null,"Zeile 24",{"$error":"#N/A"},null,"M.HZ",{"$f":"HLOOKUP($F$3,$A$234:$F$272,39,0)","v":"noch zu übersetzen"},"y"]
[null,"Zeile 25",{"$error":"#N/A"},null,"A40.MI",null,"x"]
[null,"Zeile 26",{"$error":"#N/A"},null,"A40.M",null,"x"]
[null,null,null,null,"I30",null,"x"]
[]
[]
[]
["Optionen",null,null,null,1,2,3,4,5,6,7]
["SI.Z4.",1,null,null,{"$f":"H289","v":{"$error":"#N/A"}},{"$f":"H289","v":{"$error":"#N/A"}},{"$f":"H289","v":{"$error":"#N/A"}},{"$f":"H289","v":{"$error":"#N/A"}},{"$f":"H289","v":{"$error":"#N/A"}},{"$f":"H290","v":{"$error":"#N/A"}},{"$f":"H290","v":{"$error":"#N/A"}}]
["SI.Z4.SR.",2,null,null,".MS",".MS",".MR",".DK",".MR"]
["SI.Z4.SO.",1,null,null,".MS.WP",".MS.WP",".MR.MS",".MR",".MR.MS"]
["SI.Z4.RS.",1,null,null,".WP",".WP",".MR.WP",".MR.DK",".MR.WP"]
[null,null,null,null,null,null,".MR.MS.WP",".MR.MS",".MR.MS.WP"]
[null,null,null,null,null,null,".MS",".MR.WP",".MS"]
["MI.CO",0,null,null,null,null,".MS.WP",".MR.MS.DK",".MS.WP"]
["MI.FD",2,null,null,null,null,".WP",".MR.MS.WP",".WP"]
["MI.AP2.FD",0,null,null,null,null,null,".MR.WP.DK"]
["MI.AP2.BL",0,null,null,null,null,null,".MR.MS.WP.DK"]
["MI.HZ",3,null,null,null,null,null,".MS"]
["A40.MI",0,null,null,null,null,null,".MS.DK"]
["I30",6,null,null,null,null,null,".MS.WP"]
["A40.MI",0,null,null,null,null,null,".MS.WP.DK"]
["I30",6,null,null,null,null,null,".WP"]
["M.CO",0,null,null,null,null,null,".WP.DK"]
["M.AP2.FD",0]
["M.HZ",3,null,null,".DK",{"$f":"HLOOKUP($F$3,$A$234:$F$287,40,0)","v":"aftagelig knop"}]
["A40.M",0,null,null,".MR",{"$f":"HLOOKUP($F$3,$A$234:$F$287,41,0)","v":"Multi-point"}]
["I30",6,null,null,".MR.DK",{"$f":"HLOOKUP($F$3,$A$234:$F$287,42,0)","v":"aftagelig knop, Multi-point"}]
[null,null,null,null,".MR.MS",{"$f":"HLOOKUP($F$3,$A$234:$F$287,43,0)","v":"Multi-point, Messing"}]
[null,null,null,null,".MR.WP",{"$f":"HLOOKUP($F$3,$A$234:$F$287,44,0)","v":"Multi-point, Vejrbestandig (udendørs)"}]
[null,null,null,null,".MR.MS.DK",{"$f":"HLOOKUP($F$3,$A$234:$F$287,45,0)","v":"Multi-point, Messing, aftagelig knop"}]
[null,null,null,null,".MR.MS.WP",{"$f":"HLOOKUP($F$3,$A$234:$F$287,46,0)","v":"Multi-point, Messing, Vejrbestandig (udendørs)"}]
["Zeile 20",{"$f":"VLOOKUP($C20,$A$143:$B$146,2,FALSE)+VLOOKUP($E20,$A$149:$B$162,2,FALSE)","v":{"$error":"#N/A"}},null,null,".MR.WP.DK",{"$f":"HLOOKUP($F$3,$A$234:$F$287,47,0)","v":"Multi-point, Vejrbestandig (udendørs), aftagelig knop"}]
["Zeile 21",{"$error":"#N/A"},null,null,".MR.MS.WP.DK",{"$f":"HLOOKUP($F$3,$A$234:$F$287,48,0)","v":"Multi-point, Messing, Vejrbestandig (udendørs), aftagelig knop"}]
["Zeile 22",{"$error":"#N/A"},null,null,".MS",{"$f":"HLOOKUP($F$3,$A$234:$F$287,49,0)","v":"Messing"}]
["Zeile 23",{"$error":"#N/A"},null,null,".MS.DK",{"$f":"HLOOKUP($F$3,$A$234:$F$287,50,0)","v":"Messing, aftagelig knop"}]
["Zeile 24",{"$error":"#N/A"},null,null,".MS.WP",{"$f":"HLOOKUP($F$3,$A$234:$F$287,51,0)","v":"Messing, Vejrbestandig (udendørs)"}]
["Zeile 25",{"$error":"#N/A"},null,null,".MS.WP.DK",{"$f":"HLOOKUP($F$3,$A$234:$F$287,52,0)","v":"Messing, Vejrbestandig (udendørs), aftagelig knop"}]
["Zeile 26",{"$error":"#N/A"},null,null,".WP",{"$f":"HLOOKUP($F$3,$A$234:$F$287,53,0)","v":"Vejrbestandig (udendørs)"}]
[null,null,null,null,".WP.DK",{"$f":"HLOOKUP($F$3,$A$234:$F$287,54,0)","v":"Vejrbestandig (udendørs), aftagelig knop"}]
[]
[]
[null,"Außenlänge","Innenlänge",null,"Außenlänge"]
[null,null,null,null,1,2,3,4]
["MI.CO",1,1,null,"30-","35-",{"$f":"H290","v":{"$error":"#N/A"}},{"$f":"H290","v":{"$error":"#N/A"}}]
["MI.FD",1,2,null,"35-","40-"]
["MI.AP2.FD",1,1,null,"40-","45-"]
["MI.AP2.BL",1,1,null,"45-","50-"]
["MI.HZ",1,4,null,"50-","55-"]
["A40.MI",3,6,null,"55-","60-"]
["I30",3,6,null,"60-","65-"]
["A40.MI",3,6,null,"65-","70-"]
["I30",3,6,null,"70-","75-"]
["MI.CO",1,1,null,"75-","80-"]
["M.CO",1,1,null,"80-","85-"]
["M.AP2.FD",1,1,null,"85-","90-"]
["M.HZ",1,4,null,"90-"]
["A40.M",3,6]
["I30",3,6]
[null,null,null,null,"Innenlänge"]
[null,null,null,null,1,2,3,4,5,6,7]
[null,null,null,null,"30.","30.","35.","10.","10.",{"$f":"H290","v":{"$error":"#N/A"}},{"$f":"H290","v":{"$error":"#N/A"}}]
[".MS",0,0,null,"35.","35.","40."]
[".MS.WP",0,1,null,"40.","40.","45."]
[".WP",0,1,null,"45.","45.","50."]
[".MR",1,0,null,"50.","50.","55."]
[".MR.MS",1,0,null,"55.","55.","60."]
[".MR.WP",1,1,null,"60.","60.","65."]
[".MR.MS.WP",0,1,null,"65.","65.","70."]
[{"$f":"H289","v":{"$error":"#N/A"}},0,0,null,"70.","70.","75."]
[".DK",0,0,null,"75.","75.","80."]
[".MR.DK",1,0,null,"80.","80.","85."]
[".MR.MS.DK",1,0,null,"85.","85.","90."]
[".MR.WP.DK",1,0,null,"90.","90."]
[".MR.MS.WP.DK",1,1]
[".MS.DK",0,0]
[".MS.WP.DK",0,1]
[".WP.DK",0,1]
[]
["Zeile 20",{"$f":"VLOOKUP($E20,$A$179:$B$193,2,FALSE)+VLOOKUP($F20,$A$197:$B$212,2,FALSE)","v":{"$error":"#N/A"}},{"$f":"VLOOKUP($E20,$A$179:$C$193,3,FALSE)+VLOOKUP($F20,$A$197:$C$212,3,FALSE)","v":{"$error":"#N/A"}}]
["Zeile 21",{"$error":"#N/A"},{"$error":"#N/A"}]
["Zeile 22",{"$error":"#N/A"},{"$error":"#N/A"}]
["Zeile 23",{"$error":"#N/A"},{"$error":"#N/A"}]
["Zeile 24",{"$error":"#N/A"},{"$error":"#N/A"}]
["Zeile 25",{"$error":"#N/A"},{"$error":"#N/A"}]
["Zeile 26",{"$error":"#N/A"},{"$error":"#N/A"}]
[]
[]
[]
[]
[]
[]
[]
[]
[]
[]
["Î","P"]
[]
[null,null,null,null,null,null,"Menge","Programmierung"]
["Deutsch","English","Français","Italiano","Nederlands","Dansk",1,{"$f":"IF($F$3=\"Deutsch\",$A$265,IF($F$3=\"English\",$B$265,IF($F$3=\"Français\",$C$265,IF($F$3=\"Italiano\",$D$265,IF($F$3=\"Nederlands\",$E$265,\"\")))))","v":""},"SI.SMARTCD"]
["Anzahl","Quantity","Quantité","Quantità","Aantal","Antal",2,{"$f":"IF($F$3=\"Deutsch\",$A$266,IF($F$3=\"English\",$B$266,IF($F$3=\"Français\",$C$266,IF($F$3=\"Italiano\",$D$266,IF($F$3=\"Nederlands\",$E$266,\"\")))))","v":""},"SI.SW"]
["Profil","Lock Code","Profil","Codice del profilo","Sluiting code","Låsecylinder type / varenummer",3]
["Variante","Variant","variante","variante",null,"Variant",4,"Gateway Nodes"]
["Optionen","Options","Options","Opzioni","Opties","Valgmuligheder",5,{"$f":"IF($F$3=\"Deutsch\",$A$270,IF($F$3=\"English\",$B$270,IF($F$3=\"Français\",$C$270,IF($F$3=\"Italiano\",$D$270,IF($F$3=\"Nederlands\",$E$270,\"\")))))","v":""},"SI.GN.CR"]
["Außenlänge","Outside Length","longueur extérieur","longueur extérieur","buiten lengte","Udvendig længde",6,{"$f":"IF($F$3=\"Deutsch\",$A271,IF($F$3=\"English\",$B271,IF($F$3=\"Français\",$C271,IF($F$3=\"Italiano\",$D271,IF($F$3=\"Nederlands\",$E271,\"\")))))","v":""},"SI.GN.ER"]
["Innenlänge","Inside Length","longueur intérieur","longueur intérieur","binnen lengte","Indvendig længde",7,{"$f":"IF($F$3=\"Deutsch\",$A$272,IF($F$3=\"English\",$B$272,IF($F$3=\"Français\",$C$272,IF($F$3=\"Italiano\",$D$272,IF($F$3=\"Nederlands\",$E$272,\"\")))))","v":""},"SI.GN.R"]
["kpl. Artikelnummer","Complete Part Number","Code article complet","Numero articolo completo","Complete onderdeel nummer","Komplet varenummer",8]
["Kundennummer","Customer No.","Numéro de client","Cliente numero","Klantnr.","Kundenummer",9]
["Kundenname","Customer Name","Nom du client","Nome cliente","Klant naam","Kundenavn",10]
["Projekt-Nr.  ","Project No.","Numéro de projet","Progetto numero","Projectnr.","Projektnummer",11]
["Projekt-Name  ","Project Name","Nom du projet","Nome progetto","Project naam","Projektnavn",12]
["Anlage zu Bestellnummer  ","Attachment to Order No.","Pièce(s) jointe(s) à la commande","Allegato all'ordine","Bijlage bij ordernr.","Tillæg til ordrenummer",13]
["Bestellhilfe Digitale Schließzylinder","Ordering Guide Digital Cylinders","Guide de commande pour cylindres","Guida all'ordinazione di Cilindri di chiusura","Bestelhulp Digitale Cilinders","Bestillingsvejledning til digitale låsecylindre",14]
["Europrofil","Europrofile","profil européen","profilo europeo","Euro profiel","Europrofil",15]
["Swiss Round","Swiss Round","profil suisse","tondo svizzero","Swiss Round","Schweizisk Rund",16]
["Scandinavian Oval","Scandinavian Oval","Ovale scandinave","Scandinavian Oval","Scandinavian Oval","Skandinavisk Oval",17]
["Scandinavian Round","Scandinavian Round","Scandinavian Round","Scandinavian Round","Scandinavian Round","Skandinavisk Rund",18]
["Artikelnummer korrekt?","Part Number Correct?","Code article correct?","Numero articolo giusto?","onderdeel nummer juist?","Korrekt varenummer?",19]
["Download Bestellhilfe","Download of the ordering guide","Téléchargement Guide de commande","Scaricamento del Guida all'ordinazione di Smart Handle","Download Bestelhulp Digitale SmartHandle","Download bestillingsvejledning",20]
["*** Bitte Makros aktivieren ***","*** Please enable macros ***","*** S'il vous plaît activer les macros ***","*** Si prega di abilitare le macro ***","*** Schakel macro's ***","*** Aktiver venligst makroer ***",21]
["    Maßangaben in mm","    measurements indicated in mm","    dimensions en mm","    Misure in mm","    Afmetingen in mm","Mål angives i mm",22]
["                Außenlänge","              outside length","               côté extérieur","              Lato esterno","                 Butenkant","Udvendig længde",23]
["Innenlänge","inside length","côté interieur","Lato interno","Binnenkant","Indvendig længde",24]
["zum Produkt","about the product","voir le produit","vai al prodotto","product bekijken","om produktet:",25]
["http://www.smartintego.com/de/home/produkte/digitaler-schliesszylinder-si/","http://www.smartintego.com/int/home/products/digital-locking-cylinder-si/","http://www.smartintego.com/int/home/products/digital-locking-cylinder-si/","http://www.smartintego.com/int/home/products/digital-locking-cylinder-si/","http://www.smartintego.com/int/home/products/digital-locking-cylinder-si/","http://www.smartintego.com/int/home/products/digital-locking-cylinder-si/",26]
["Digitale Schließzylinder SI","Digital Locking Cylinder SI","Digital Locking Cylinder SI","Digital Locking Cylinder SI","Digital Locking Cylinder SI","Digital Låsecylinder SI (engelsk)",27]
["http://www.smartintego.com/fileadmin/SmartIntego/PDFs/Produktkatalog_SmartIntego_DE.pdf","http://www.smartintego.com/fileadmin/SmartIntego/PDFs/Productcatalogue%20_SmartIntego_EN.pdf","http://www.smartintego.com/fileadmin/SmartIntego/PDFs/Productcatalogue%20_SmartIntego_EN.pdf","http://www.smartintego.com/fileadmin/SmartIntego/PDFs/Productcatalogue%20_SmartIntego_EN.pdf","http://www.smartintego.com/fileadmin/SmartIntego/PDFs/Productcatalogue%20_SmartIntego_EN.pdf","http://www.smartintego.com/fileadmin/SmartIntego/PDFs/Productcatalogue%20_SmartIntego_EN.pdf",28]
["Produktkatalog SmartIntego","Product Catalogue SmartIntego","Product Catalogue SmartIntego","Product Catalogue SmartIntego","Product Catalogue SmartIntego","Produktkatalog SmartIntego (engelsk)",29]
["http://www.smartintego.com/fileadmin/SmartIntego/PDFs/Broschuere_SmartIntego_DE.pdf","http://www.smartintego.com/fileadmin/SmartIntego/PDFs/Brochure_SmartIntego_UK.pdf","http://www.smartintego.com/fileadmin/SmartIntego/PDFs/Brochure_SmartIntego_UK.pdf","http://www.smartintego.com/fileadmin/SmartIntego/PDFs/Brochure_SmartIntego_UK.pdf","http://www.smartintego.com/fileadmin/SmartIntego/PDFs/Brochure_SmartIntego_UK.pdf","http://www.smartintego.com/fileadmin/SmartIntego/PDFs/Brochure_SmartIntego_UK.pdf",30]
["Broschüre SmartIntego","Brochure SmartIntego","Brochure SmartIntego","Brochure SmartIntego","Brochure SmartIntego","Brochure SmartIntego (engelsk)",31]
["Bemerkungen","Comments","Remarque","Note","Beperkingen","Bemærkninger",32]
["http://www.smartintego.com/de/home/infocenter/downloads/","http://www.smartintego.com/int/home/infocenter/downloads/","http://www.smartintego.com/int/home/infocenter/downloads/","http://www.smartintego.com/int/home/infocenter/downloads/","http://www.smartintego.com/int/home/infocenter/downloads/","http://www.smartintego.com/int/home/infocenter/downloads/",33]
["Wireless Online / Virtual CardNetwork","Wireless Online / Virtual CardNetwork","Wireless Online / Virtual CardNetwork","Wireless Online / Virtual CardNetwork","Wireless Online / Virtual CardNetwork","Wireless Online / Virtual CardNetwork",34]
["Comfort","Comfort","Comfort","noch zu übersetzen","noch zu übersetzen","noch zu übersetzen",35]
["freidrehend","freely rotating","Rotation libre des deux côtés","noch zu übersetzen","noch zu übersetzen","noch zu übersetzen",36]
["Antipanik freidrehend","Antipanic freely rotating","Anti-panique rotation libre des deux côtés","noch zu übersetzen","noch zu übersetzen","noch zu übersetzen",37]
["Antipanik beidseitig lesend","Anti-panique (reading on both sides)","noch zu übersetzen","noch zu übersetzen","noch zu übersetzen","noch zu übersetzen",38]
["Halbzylinder","half cylinder","Demi-cylindre","noch zu übersetzen","noch zu übersetzen","noch zu übersetzen",39]
["demontierbarer Knauf","detachable knob","bouton démontable","pomolo smontabile","demonteerbare knop","aftagelig knop",40]
["Multirast","Multi-point","multi-enclenchements","Multirast","multirust-uitvoering","Multi-point",41]
["Multirast, demontierbarer Knauf","detachable knob, Multi-point","bouton démontable, multi-enclenchements","pomolo smontabile, Multirast","demonteerbare knop, multirust-uitvoering","aftagelig knop, Multi-point",42]
["Multirast, Messing","Multi-point, Brass","multi-enclenchements, Laiton","Multirast, Ottone","multirust-uitvoering, Messing","Multi-point, Messing",43]
["Multirast, Wetterfest","Multi-point, Weatherproof","multi-enclenchements, étanche","Multirast, resistente alle intemperie","multirust-uitvoering, Weerbestendig","Multi-point, Vejrbestandig (udendørs)",44]
["Multirast, Messing, demontierbarer Knauf","Multi-point, Brass, detachable knob","multi-enclenchements, Laiton, bouton démontable","Multirast, Ottone, pomolo smontabile","multirust-uitvoering, Messing, demonteerbare knop","Multi-point, Messing, aftagelig knop",45]
["Multirast, Messing, Wetterfest","Multi-point, Brass, Weatherproof","multi-enclenchements, Laiton, étanche","Multirast, Ottone, resistente alle intemperie","multirust-uitvoering, Messing, Weerbestendig","Multi-point, Messing, Vejrbestandig (udendørs)",46]
["Multirast, Wetterfest, demontierbarer Knauf","Multi-point, Weatherproof, detachable knob","multi-enclenchements, étanche, bouton démontable","Multirast, resistente alle intemperie, pomolo smontabile","multirust-uitvoering, Weerbestendig, demonteerbare knop","Multi-point, Vejrbestandig (udendørs), aftagelig knop",47]
["Multirast, Messing, Wetterfest, demontierbarer Knauf","Multi-point, Brass, Weatherproof, detachable knob","multi-enclenchements, Laiton, étanche, bouton démontable","Multirast, Ottone, resistente alle intemperie, pomolo smontabile","multirust-uitvoering, Messing, Weerbestendig, demonteerbare knop","Multi-point, Messing, Vejrbestandig (udendørs), aftagelig knop",48]
["Messing","Brass","Laiton","Ottone","Messing","Messing",49]
["Messing, demontierbarer Knauf","Brass, detachable knob","Laiton, bouton démontable","Ottone, pomolo smontabile","Messing, demonteerbare knop","Messing, aftagelig knop",50]
["Messing, Wetterfest","Brass, Weatherproof","Laiton, étanche","Ottone, resistente alle intemperie","Messing, Weerbestendig","Messing, Vejrbestandig (udendørs)",51]
["Messing, Wetterfest, demontierbarer Knauf","Brass, Weatherproof, detachable knob","Laiton, étanche, bouton démontable","Ottone, resistente alle intemperie, pomolo smontabile","Messing, Weerbestendig, demonteerbare knop","Messing, Vejrbestandig (udendørs), aftagelig knop",52]
["Wetterfest","Weatherproof","étanche","resistente alle intemperie","Weerbestendig","Vejrbestandig (udendørs)",53]
["Wetterfest, demontierbarer Knauf","Weatherproof, detachable knob","étanche, bouton démontable","resistente alle intemperie, pomolo smontabile","Weerbestendig, demonteerbare knop","Vejrbestandig (udendørs), aftagelig knop",54]
["zurück zur Hauptseite","back to main page","noch zu übersetzen","noch zu übersetzen","noch zu übersetzen","noch zu übersetzen",55,{"$f":"SI_Programming_Gateways!$J$235","v":"noch zu übersetzen"}]
["nicht benötigt","not required","noch zu übersetzen","noch zu übersetzen","noch zu übersetzen","noch zu übersetzen",56,{"$f":"HLOOKUP('Hauptseite - main page'!$G$3,SI_Zylinder!$A$234:$F$289,56)","v":{"$error":"#N/A"}}]
["nicht verfügbar","not available","noch zu übersetzen","noch zu übersetzen","noch zu übersetzen","noch zu übersetzen",57,{"$f":"HLOOKUP('Hauptseite - main page'!$G$3,SI_Zylinder!$A$234:$F$290,57)","v":{"$error":"#N/A"}}]
[null,null,null,null,null,null,58]
[null,null,null,null,null,null,59]
[null,null,null,null,null,null,60]
[null,null,null,null,null,null,61]
[null,null,null,null,null,null,62]
[null,null,null,null,null,null,63]
[null,null,null,null,null,null,64]
[null,null,null,null,null,null,65]
[null,null,null,null,null,null,66]
[null,null,null,null,null,null,67]
[null,null,null,null,null,null,68]
[null,null,null,null,null,null,69]
[null,null,null,null,null,null,70]
[null,null,null,null,null,null,71]
[null,null,null,null,null,null,72]
[null,null,null,null,null,null,73]
[null,null,null,null,null,null,74]
[null,null,null,null,null,null,75]
[null,null,null,null,null,null,76]
[null,null,null,null,null,null,77]
[null,null,null,null,null,null,78]
[null,null,null,null,null,null,79]
[null,null,null,null,null,null,80]
[null,null,null,null,null,null,81]
[null,null,null,null,null,null,82]
[null,null,null,null,null,null,83]
[null,null,null,null,null,null,84]
[null,null,null,null,null,null,85]
[null,null,null,null,null,null,86]
[null,null,null,null,null,null,87]
[null,null,null,null,null,null,88]
[null,null,null,null,null,null,89]
[null,null,null,null,null,null,90]
[null,null,null,null,null,null,91]
[null,null,null,null,null,null,92]
[null,null,null,null,null,null,93]
[null,null,null,null,null,null,94]
[null,null,null,null,null,null,95]
[null,null,null,null,null,null,96]
[null,null,null,null,null,null,97]
[null,null,null,null,null,null,98]
[null,null,null,null,null,null,99]
[null,null,null,null,null,null,100]
[null,null,null,null,null,null,101]
[null,null,null,null,null,null,102]
[null,null,null,null,null,null,103]
[null,null,null,null,null,null,104]
[null,null,null,null,null,null,105]
[null,null,null,null,null,null,106]
[null,null,null,null,null,null,107]
[null,null,null,null,null,null,108]
[null,null,null,null,null,null,109]
[null,null,null,null,null,null,110]
[null,null,null,null,null,null,111]
[null,null,null,null,null,null,112]
[null,null,null,null,null,null,113]
[null,null,null,null,null,null,114]
[null,null,null,null,null,null,115]
[null,null,null,null,null,null,116]
[null,null,null,null,null,null,117]
[null,null,null,null,null,null,118]
[null,null,null,null,null,null,119]
[null,null,null,null,null,null,120]
[null,null,null,null,null,null,121]
[null,null,null,null,null,null,122]
[null,null,null,null,null,null,123]
[null,null,null,null,null,null,124]
[null,null,null,null,null,null,125]
[null,null,null,null,null,null,126]
[null,null,null,null,null,null,127]
[null,null,null,null,null,null,128]
[null,null,null,null,null,null,129]
[null,null,null,null,null,null,130]
[null,null,null,null,null,null,131]
[null,null,null,null,null,null,132]
[null,null,null,null,null,null,133]
[null,null,null,null,null,null,134]
[null,null,null,null,null,null,135]
[null,null,null,null,null,null,136]
[null,null,null,null,null,null,137]
[null,null,null,null,null,null,138]
[null,null,null,null,null,null,139]
[null,null,null,null,null,null,140]
[null,null,null,null,null,null,141]
[null,null,null,null,null,null,142]
[null,null,null,null,null,null,143]
[null,null,null,null,null,null,144]
[null,null,null,null,null,null,145]
[null,null,null,null,null,null,146]
[null,null,null,null,null,null,147]
[null,null,null,null,null,null,148]
[null,null,null,null,null,null,149]
[null,null,null,null,null,null,150]
[null,null,null,null,null,null,151]
[null,null,null,null,null,null,152]
[null,null,null,null,null,null,153]
[null,null,null,null,null,null,154]
[null,null,null,null,null,null,155]
[null,null,null,null,null,null,156]
[null,null,null,null,null,null,157]
[null,null,null,null,null,null,158]
[null,null,null,null,null,null,159]
[null,null,null,null,null,null,160]
[null,null,null,null,null,null,161]
[null,null,null,null,null,null,162]
[null,null,null,null,null,null,163]
[null,null,null,null,null,null,164]
[null,null,null,null,null,null,165]
[null,null,null,null,null,null,166]
[null,null,null,null,null,null,167]
[null,null,null,null,null,null,168]
[null,null,null,null,null,null,169]
[null,null,null,null,null,null,170]
[null,null,null,null,null,null,171]
[null,null,null,null,null,null,172]
[null,null,null,null,null,null,173]
[null,null,null,null,null,null,174]
[null,null,null,null,null,null,175]
[null,null,null,null,null,null,176]
[null,null,null,null,null,null,177]
[null,null,null,null,null,null,178]
[null,null,null,null,null,null,179]
[null,null,null,null,null,null,180]
[null,null,null,null,null,null,181]
[null,null,null,null,null,null,182]
[null,null,null,null,null,null,183]
[null,null,null,null,null,null,184]
[null,null,null,null,null,null,185]
[null,null,null,null,null,null,186]
[null,null,null,null,null,null,187]
[null,null,null,null,null,null,188]
[null,null,null,null,null,null,189]
[null,null,null,null,null,null,190]
[null,null,null,null,null,null,191]
[null,null,null,null,null,null,192]
[null,null,null,null,null,null,193]
[null,null,null,null,null,null,194]
[null,null,null,null,null,null,195]
[null,null,null,null,null,null,196]
[null,null,null,null,null,null,197]
[null,null,null,null,null,null,198]
[null,null,null,null,null,null,199]
[null,null,null,null,null,null,200]
[null,null,null,null,null,null,201]
[null,null,null,null,null,null,202]
[null,null,null,null,null,null,203]
[null,null,null,null,null,null,204]
[null,null,null,null,null,null,205]
[null,null,null,null,null,null,206]
[null,null,null,null,null,null,207]
[null,null,null,null,null,null,208]
[null,null,null,null,null,null,209]
[null,null,null,null,null,null,210]
[null,null,null,null,null,null,211]
[null,null,null,null,null,null,212]
[null,null,null,null,null,null,213]
[null,null,null,null,null,null,214]
[null,null,null,null,null,null,215]
[null,null,null,null,null,null,216]
[null,null,null,null,null,null,217]
[null,null,null,null,null,null,218]
[null,null,null,null,null,null,219]
[null,null,null,null,null,null,220]
[null,null,null,null,null,null,221]
[null,null,null,null,null,null,222]
[null,null,null,null,null,null,223]
[null,null,null,null,null,null,224]
[null,null,null,null,null,null,225]
[null,null,null,null,null,null,226]
[null,null,null,null,null,null,227]
[null,null,null,null,null,null,228]
[null,null,null,null,null,null,229]
[null,null,null,null,null,null,230]
[null,null,null,null,null,null,231]
[null,null,null,null,null,null,232]
[null,null,null,null,null,null,233]
[null,null,null,null,null,null,234]
[null,null,null,null,null,null,235]
[null,null,null,null,null,null,236]
[null,null,null,null,null,null,237]
[null,null,null,null,null,null,238]
[null,null,null,null,null,null,239]
[null,null,null,null,null,null,240]
[null,null,null,null,null,null,241]
[null,null,null,null,null,null,242]
[null,null,null,null,null,null,243]
[null,null,null,null,null,null,244]
[null,null,null,null,null,null,245]
[null,null,null,null,null,null,246]
[null,null,null,null,null,null,247]
[null,null,null,null,null,null,248]
[null,null,null,null,null,null,249]
[null,null,null,null,null,null,250]
[null,null,null,null,null,null,251]
[null,null,null,null,null,null,252]
[null,null,null,null,null,null,253]
[null,null,null,null,null,null,254]
[null,null,null,null,null,null,255]
[null,null,null,null,null,null,256]
[null,null,null,null,null,null,257]
[null,null,null,null,null,null,258]
[null,null,null,null,null,null,259]
[null,null,null,null,null,null,260]
[null,null,null,null,null,null,261]
[null,null,null,null,null,null,262]
[null,null,null,null,null,null,263]
[null,null,null,null,null,null,264]
[null,null,null,null,null,null,265]
[null,null,null,null,null,null,266]
[null,null,null,null,null,null,267]
[null,null,null,null,null,null,268]
[null,null,null,null,null,null,269]
[null,null,null,null,null,null,270]
[null,null,null,null,null,null,271]
[null,null,null,null,null,null,272]
[null,null,null,null,null,null,273]
[null,null,null,null,null,null,274]
[null,null,null,null,null,null,275]
[null,null,null,null,null,null,276]
[null,null,null,null,null,null,277]
[null,null,null,null,null,null,278]
[null,null,null,null,null,null,279]
[null,null,null,null,null,null,280]
[null,null,null,null,null,null,281]
[null,null,null,null,null,null,282]
[null,null,null,null,null,null,283]
[null,null,null,null,null,null,284]
[null,null,null,null,null,null,285]
[null,null,null,null,null,null,286]
[null,null,null,null,null,null,287]
[null,null,null,null,null,null,288]
[null,null,null,null,null,null,289]
[null,null,null,null,null,null,290]
[null,null,null,null,null,null,291]
[null,null,null,null,null,null,292]
[null,null,null,null,null,null,293]
[null,null,null,null,null,null,294]
[null,null,null,null,null,null,295]
[null,null,null,null,null,null,296]
[null,null,null,null,null,null,297]
[null,null,null,null,null,null,298]
[null,null,null,null,null,null,299]
[null,null,null,null,null,null,300]
[null,null,null,null,null,null,301]
[null,null,null,null,null,null,302]
[null,null,null,null,null,null,303]
[null,null,null,null,null,null,304]
[null,null,null,null,null,null,305]
[null,null,null,null,null,null,306]
[null,null,null,null,null,null,307]
[null,null,null,null,null,null,308]
[null,null,null,null,null,null,309]
[null,null,null,null,null,null,310]
[null,null,null,null,null,null,311]
[null,null,null,null,null,null,312]
[null,null,null,null,null,null,313]
[null,null,null,null,null,null,314]
[null,null,null,null,null,null,315]
[null,null,null,null,null,null,316]
[null,null,null,null,null,null,317]
[null,null,null,null,null,null,318]
[null,null,null,null,null,null,319]
[null,null,null,null,null,null,320]
[null,null,null,null,null,null,321]
[null,null,null,null,null,null,322]
[null,null,null,null,null,null,323]
[null,null,null,null,null,null,324]
[null,null,null,null,null,null,325]
[null,null,null,null,null,null,326]
[null,null,null,null,null,null,327]
[null,null,null,null,null,null,328]
[null,null,null,null,null,null,329]
[null,null,null,null,null,null,330]
[null,null,null,null,null,null,331]
[null,null,null,null,null,null,332]
[null,null,null,null,null,null,333]
[null,null,null,null,null,null,334]
[null,null,null,null,null,null,335]
[null,null,null,null,null,null,336]
[null,null,null,null,null,null,337]
[null,null,null,null,null,null,338]
[null,null,null,null,null,null,339]
[null,null,null,null,null,null,340]
[null,null,null,null,null,null,341]
[null,null,null,null,null,null,342]
[null,null,null,null,null,null,343]
[null,null,null,null,null,null,344]
[null,null,null,null,null,null,345]
[null,null,null,null,null,null,346]
[null,null,null,null,null,null,347]
[null,null,null,null,null,null,348]
[null,null,null,null,null,null,349]
[null,null,null,null,null,null,350]
[null,null,null,null,null,null,351]
[null,null,null,null,null,null,352]
[null,null,null,null,null,null,353]
[null,null,null,null,null,null,354]
[null,null,null,null,null,null,355]
[null,null,null,null,null,null,356]
[null,null,null,null,null,null,357]
[null,null,null,null,null,null,358]
[null,null,null,null,null,null,359]
[null,null,null,null,null,null,360]
[null,null,null,null,null,null,361]
[null,null,null,null,null,null,362]
[null,null,null,null,null,null,363]
[null,null,null,null,null,null,364]
[null,null,null,null,null,null,365]
[null,null,null,null,null,null,366]
[null,null,null,null,null,null,367]
[null,null,null,null,null,null,368]
[null,null,null,null,null,null,369]
[null,null,null,null,null,null,370]
[null,null,null,null,null,null,371]
[null,null,null,null,null,null,372]
[null,null,null,null,null,null,373]
[null,null,null,null,null,null,374]
[null,null,null,null,null,null,375]
[null,null,null,null,null,null,376]
[null,null,null,null,null,null,377]
[null,null,null,null,null,null,378]
[null,null,null,null,null,null,379]
[null,null,null,null,null,null,380]
[null,null,null,null,null,null,381]
[null,null,null,null,null,null,382]
[null,null,null,null,null,null,383]
[null,null,null,null,null,null,384]
[null,null,null,null,null,null,385]
[null,null,null,null,null,null,386]
[null,null,null,null,null,null,387]
[null,null,null,null,null,null,388]
[null,null,null,null,null,null,389]
[null,null,null,null,null,null,390]
[null,null,null,null,null,null,391]
[null,null,null,null,null,null,392]
[null,null,null,null,null,null,393]
[null,null,null,null,null,null,394]
[null,null,null,null,null,null,395]
[null,null,null,null,null,null,396]
[null,null,null,null,null,null,397]
[null,null,null,null,null,null,398]
[null,null,null,null,null,null,399]
[null,null,null,null,null,null,400]
[null,null,null,null,null,null,401]
[null,null,null,null,null,null,402]
[null,null,null,null,null,null,403]
[null,null,null,null,null,null,404]
[null,null,null,null,null,null,405]
[null,null,null,null,null,null,406]
[null,null,null,null,null,null,407]
[null,null,null,null,null,null,408]
[null,null,null,null,null,null,409]
[null,null,null,null,null,null,410]
[null,null,null,null,null,null,411]
[null,null,null,null,null,null,412]
[null,null,null,null,null,null,413]
[null,null,null,null,null,null,414]
[null,null,null,null,null,null,415]
[null,null,null,null,null,null,416]
[null,null,null,null,null,null,417]
[null,null,null,null,null,null,418]
[null,null,null,null,null,null,419]
[null,null,null,null,null,null,420]
[null,null,null,null,null,null,421]
[null,null,null,null,null,null,422]
[null,null,null,null,null,null,423]
[null,null,null,null,null,null,424]
[null,null,null,null,null,null,425]
[null,null,null,null,null,null,426]
[null,null,null,null,null,null,427]
[null,null,null,null,null,null,428]
[null,null,null,null,null,null,429]
[null,null,null,null,null,null,430]
[null,null,null,null,null,null,431]
[null,null,null,null,null,null,432]
[null,null,null,null,null,null,433]
[null,null,null,null,null,null,434]
[null,null,null,null,null,null,435]
[null,null,null,null,null,null,436]
[null,null,null,null,null,null,437]
[null,null,null,null,null,null,438]
[null,null,null,null,null,null,439]
[null,null,null,null,null,null,440]
[null,null,null,null,null,null,441]
[null,null,null,null,null,null,442]
[null,null,null,null,null,null,443]
[null,null,null,null,null,null,444]
[null,null,null,null,null,null,445]
[null,null,null,null,null,null,446]
[null,null,null,null,null,null,447]
[null,null,null,null,null,null,448]
[null,null,null,null,null,null,449]
[null,null,null,null,null,null,450]
[null,null,null,null,null,null,451]
[null,null,null,null,null,null,452]
[null,null,null,null,null,null,453]
[null,null,null,null,null,null,454]
[null,null,null,null,null,null,455]
[null,null,null,null,null,null,456]
[null,null,null,null,null,null,457]
[null,null,null,null,null,null,458]
[null,null,null,null,null,null,459]
[null,null,null,null,null,null,460]
[null,null,null,null,null,null,461]
[null,null,null,null,null,null,462]
[null,null,null,null,null,null,463]
[null,null,null,null,null,null,464]
[null,null,null,null,null,null,465]
[null,null,null,null,null,null,466]
[null,null,null,null,null,null,467]
[null,null,null,null,null,null,468]
[null,null,null,null,null,null,469]
[null,null,null,null,null,null,470]
[null,null,null,null,null,null,471]
[null,null,null,null,null,null,472]
[null,null,null,null,null,null,473]
[null,null,null,null,null,null,474]
[null,null,null,null,null,null,475]
[null,null,null,null,null,null,476]
[null,null,null,null,null,null,477]
[null,null,null,null,null,null,478]
[null,null,null,null,null,null,479]
[null,null,null,null,null,null,480]
[null,null,null,null,null,null,481]
[null,null,null,null,null,null,482]
[null,null,null,null,null,null,483]
[null,null,null,null,null,null,484]
[null,null,null,null,null,null,485]
[null,null,null,null,null,null,486]
[null,null,null,null,null,null,487]
[null,null,null,null,null,null,488]
[null,null,null,null,null,null,489]
[null,null,null,null,null,null,490]
[null,null,null,null,null,null,491]
[null,null,null,null,null,null,492]
[null,null,null,null,null,null,493]
[null,null,null,null,null,null,494]
[null,null,null,null,null,null,495]
[null,null,null,null,null,null,496]
[null,null,null,null,null,null,497]
[null,null,null,null,null,null,498]
[null,null,null,null,null,null,499]
[null,null,null,null,null,null,500]

{"sheet":"SmartHandle Cover - order tool","index":5,"n_rows":325,"n_cols":50,"rows_kept":325,"cut":false,"hidden":true,"merged":[[19,3,19,7],[20,3,20,7],[21,3,21,7],[22,3,22,7],[1,3,1,6],[3,3,3,6],[6,7,7,7],[6,0,7,0],[6,5,7,5],[16,0,16,6],[18,3,18,7],[17,3,17,7],[6,1,7,1],[6,2,7,2],[6,3,7,3],[6,6,7,6],[6,4,7,4]]}
[]
[]
[{"$f":"HLOOKUP($J$3,$A$62:$F$114,2,0)","v":{"$error":"#N/A"}},null,null,null,null,{"$f":"'Hauptseite - main page'!G3","v":"Dansk"},null,null,null,{"$f":"'Hauptseite - main page'!G3","v":"Dansk"}]
[]
[]
[]
[{"$f":"HLOOKUP($J$3,$A$62:$G$236,36,0)","v":36},{"$f":"HLOOKUP($J$3,$A$62:$F$114,3,0)","v":{"$error":"#N/A"}},{"$f":"HLOOKUP($J$3,$A$62:$F$114,4,0)","v":{"$error":"#N/A"}},{"$f":"HLOOKUP($J$3,$A$62:$F$114,5,0)","v":{"$error":"#N/A"}},{"$f":"HLOOKUP($J$3,$A$62:$G$236,32,0)","v":"noch zu übersetzen"},{"$f":"HLOOKUP($J$3,$A$62:$F$114,38,0)","v":{"$error":"#N/A"}},{"$f":"HLOOKUP($J$3,$A$62:$F$114,6,0)","v":{"$error":"#N/A"}},{"$f":"HLOOKUP($J$3,$A$62:$G$236,35,0)","v":35}]
[null,null,null,null,null,null,null,null,null,null,null,null,null,null,null,null,"Beschreibung"]
[null,null,null,null,null,null,null,{"$f":"IF(AND(B9<>\"\",C9<>\"\",D9<>\"\",G9<>\"\",E9<>\"\",F9<>\"\"),I9&N9,\"\")","v":""},{"$f":"IF(AND(B9<>\"\",C9<>\"\",D9<>\"\",G9<>\"\",E9<>\"\",F9<>\"\"),VLOOKUP(G53,$S$36:$T$108,2,FALSE),\"\")","v":""},null,{"$f":"IF(H9<>\"\",\"SmartHandle Cover, \",\"\")","v":""},{"$f":"IF(H9<>\"\",C9&\", \",\"\")","v":""},{"$f":"IF(AND(H9<>\"\",D9=HLOOKUP($J$3,$B$62:$G$84,21,0)),\"MO, \",\"\")","v":""},{"$f":"IF(AND(F9<>$H$98,F9<>\"\"),\".\"&F9,\"\")","v":{"$error":"#N/A"}},{"$f":"IF(AND(H9<>\"\",F9<>H98),F7&\" = \"&F9&\"mm, \",\"\")","v":{"$error":"#N/A"}},{"$f":"IF(H9<>\"\",G9&\", \",\"\")","v":""},{"$f":"IF(H9<>\"\",E9,\"\")","v":""},{"$f":"K9&L9&M9&O9&P9&Q9","v":{"$error":"#N/A"}}]
[null,null,null,null,null,null,null,{"$f":"IF(AND(B10<>\"\",C10<>\"\",D10<>\"\",G10<>\"\",E10<>\"\",F10<>\"\"),I10&N10,\"\")","v":""},{"$f":"IF(AND(B10<>\"\",C10<>\"\",D10<>\"\",G10<>\"\",E10<>\"\",F10<>\"\"),VLOOKUP(G54,$S$36:$T$108,2,FALSE),\"\")","v":""},null,"","","",{"$error":"#N/A"},"","","",""]
[null,null,null,null,null,null,null,"","",null,"","","",{"$error":"#N/A"},{"$error":"#N/A"},"","",{"$error":"#N/A"}]
[null,null,null,null,null,null,null,"","",null,"","","",{"$error":"#N/A"},{"$error":"#N/A"},"","",{"$error":"#N/A"}]
[null,null,null,null,null,null,null,"","",null,"","","",{"$error":"#N/A"},{"$error":"#N/A"},"","",{"$error":"#N/A"}]
[null,null,null,null,null,null,null,"","",null,"","","",{"$error":"#N/A"},{"$error":"#N/A"},"","",{"$error":"#N/A"}]
[null,null," "]
[]
[]
[{"$f":"A7","v":36},{"$f":"H100","v":{"$error":"#N/A"}},{"$f":"SI_Programming_Gateways!O37","v":"Varenummer"},{"$f":"SI_Programming_Gateways!I37","v":"Produktbeskrivelse"}]
[null,null,null,{"$f":"IF(C19<>\"\",VLOOKUP(C19,C126:D136,2,FALSE),\"\")","v":""}]
[null,null,null,{"$f":"IF(C20<>\"\",VLOOKUP(C20,C127:D137,2,FALSE),\"\")","v":""}]
[null,null,null,""]
[null,"Schlosskasten für Glastüren","SHGL08A72R",{"$error":"#N/A"}]
[null,null,null,""]
[]
[]
[]
[]
[]
[{"$f":"IF(B20=\"XXX\",\"XXX\",A20)","v":0}]
[]
[null,1,2,3,null,4,5,6,7,8,9,10,11,null,12,13,14,15,16,17,18,19,20,21,22,23,24,25,26,27,28,29,30,31,32,33,34,35,36,37,38,39,40,41,42,43,44,45,46,47]
["für Außenseite","SI.SH.CS","SI.SH.CSP","SI.SH.CS.XX",null,"SI.SH.CSP.XX","SI.SH.CB","SI.SH.CBP","SI.SH.CB.XX","SI.SH.CBP.XX","SI.SH.CS.SO","SI.SH.CSP.SO","SI.SH.CS.SO.105",null,"SI.SH.CSP.SO.105","SI.SH.CB.SO","SI.SH.CBP.SO","SI.SH.CB.SO.105","SI.SH.CBP.SO.105","SI.SH.CS","SI.SH.CSP","SI.SH.CS.SR.A78","SI.SH.CSP.SR.A78","SI.SH.CB","SI.SH.CBP","SI.SH.CB.SR.A78","SI.SH.CBP.SR.A78","SI.SH2.CSP","nicht vorhanden","SI.SH2.CSP.XX","nicht vorhanden","SI.SH2.CBP","nicht vorhanden","SI.SH2.CBP.XX","nicht vorhanden","SI.SH2.CSP.SO","nicht vorhanden","SI.SH2.CSP.SO.105","nicht vorhanden","SI.SH2.CBP.SO","nicht vorhanden","SI.SH2.CBP.SO.105","nicht vorhanden","SI.SH2.CSP","nicht vorhanden","SI.SH2.CSP.SR.A78","nicht vorhanden","SI.SH2.CBP","nicht vorhanden","SI.SH2.CBP.SR.A78"]
["für Innenseite","SI.SH.CS","SI.SH.CS","SI.SH.CS.XX",null,"SI.SH.CS.XX","SI.SH.CB","SI.SH.CB","SI.SH.CB.XX","SI.SH.CB.XX","SI.SH.CS.SO","SI.SH.CS.SO","SI.SH.CS.SO.105",null,"SI.SH.CS.SO.105","SI.SH.CB.SO","SI.SH.CB.SO","SI.SH.CB.SO.105","SI.SH.CB.SO.105","SI.SH.CS","SI.SH.CS","SI.SH.CS.SR.I78","SI.SH.CS.SR.I78","SI.SH.CB","SI.SH.CB","SI.SH.CB.SR.I78","SI.SH.CB.SR.I78","SI.SH.CS","nicht vorhanden","SI.SH.CS.XX","nicht vorhanden","SI.SH.CB","nicht vorhanden","SI.SH.CB.XX","nicht vorhanden","SI.SH.CS.SO","nicht vorhanden","SI.SH.CS.SO.105","nicht vorhanden","SI.SH.CB.SO","nicht vorhanden","SI.SH.CB.SO.105","nicht vorhanden","SI.SH.CS","nicht vorhanden","SI.SH.CS.SR.I78","nicht vorhanden","SI.SH.CB","nicht vorhanden","SI.SH.CB.SR.I78"]
[]
[null,null,null,null,null,null,null,"für Entfernung (siehe W36)"]
[null,null,null,null,null,{"$f":"IF($J$3=\"Deutsch\",$B$76,IF($J$3=\"English\",$C$76,IF($J$3=\"Français\",$D$76,IF($J$3=\"Italiano\",$E$76,IF($J$3=\"Nederlands\",$F$76,\"\")))))","v":""},0,1,null,null,null,null,null,null,null,null,null,null,1,"SI.SH.CS",null,null,"für Entfernung"]
["Nr.","Beschreibung",null,null,null,{"$f":"IF($J$3=\"Deutsch\",$B$77,IF($J$3=\"English\",$C$77,IF($J$3=\"Français\",$D$77,IF($J$3=\"Italiano\",$E$77,IF($J$3=\"Nederlands\",$F$77,\"\")))))","v":""},24,3,null,null,null,null,null,null,null,null,null,null,2,"SI.SH.CS",null,null,1,2,3,4,5,6,7,8,9,10,11,12]
["SH.CB","Smart Handle Cover breit",null,null,null,{"$f":"IF($J$3=\"Deutsch\",$B$78,IF($J$3=\"English\",$C$78,IF($J$3=\"Français\",$D$78,IF($J$3=\"Italiano\",$E$78,IF($J$3=\"Nederlands\",$F$78,\"\")))))","v":""},48,2,null,null,null,null,null,null,null,null,null,null,3,"SI.SH.CB",null,null,{"$f":"$H$98","v":{"$error":"#N/A"}},{"$error":"#N/A"},{"$error":"#N/A"},{"$error":"#N/A"},{"$error":"#N/A"},{"$error":"#N/A"},70,105,"A78",70,105,"I78"]
["SH.CB.X","Smart Handle Cover breit 72",null,null,null,null,null,null,null,null,null,null,null,null,null,null,null,null,4,"SI.SH.CB",null,null,null,null,null,null,null,null,72,null,94,72,null,94]
["SH.CB.SO.105","Smart Handle Cover SO breit 105",null,null,null,{"$f":"IF($J$3=\"Deutsch\",$B$79,IF($J$3=\"English\",$C$79,IF($J$3=\"Français\",$D$79,IF($J$3=\"Italiano\",$E$79,IF($J$3=\"Nederlands\",$F$79,\"\")))))","v":""},0,null,null,null,null,null,null,null,null,null,null,null,5,"SI.SH.CS","MO",null,null,null,null,null,null,null,75,null,null,75]
["SH.CBP","Smart Handle Cover breit SC",null,null,null,{"$f":"IF($J$3=\"Deutsch\",$B$80,IF($J$3=\"English\",$C$80,IF($J$3=\"Français\",$D$80,IF($J$3=\"Italiano\",$E$80,IF($J$3=\"Nederlands\",$F$80,\"\")))))","v":""},8,null,null,null,null,null,null,null,null,null,null,null,6,"SI.SH.CS","MO",null,null,null,null,null,null,null,78,null,null,78]
["SH.CBP.X","Smart Handle Cover breit SC 72",null,null,null,{"$f":"IF($J$3=\"Deutsch\",$B$81,IF($J$3=\"English\",$C$81,IF($J$3=\"Français\",$D$81,IF($J$3=\"Italiano\",$E$81,IF($J$3=\"Nederlands\",$F$81,\"\")))))","v":""},16,null,null,null,null,null,null,null,null,null,null,null,7,"SI.SH.CB","MO",null,null,null,null,null,null,null,85,null,null,85]
["SH.CBP.SO.105","Smart Handle Cover SO breit SC 105",null,null,null,null,null,null,null,null,null,null,null,null,null,null,null,null,8,"SI.SH.CB","MO",null,null,null,null,null,null,null,88,null,null,88]
["SH.CS","Smart Handle Cover schmal",null,"Mechanical Override",null,{"$f":"IF($J$3=\"Deutsch\",$B$82,IF($J$3=\"English\",$C$82,IF($J$3=\"Français\",$D$82,IF($J$3=\"Italiano\",$E$82,IF($J$3=\"Nederlands\",$F$82,\"\")))))","v":""},4,6,null,null,null,null,null,null,null,null,null,null,9,"SI.SH.CSP",null,null,null,null,null,null,null,null,90,null,null,90]
["SH.CS.X","Smart Handle Cover schmal 72",null,"Mechanical Override",null,{"$f":"IF($J$3=\"Deutsch\",$B$83,IF($J$3=\"English\",$C$83,IF($J$3=\"Français\",$D$83,IF($J$3=\"Italiano\",$E$83,IF($J$3=\"Nederlands\",$F$83,\"\")))))","v":""},0,0,null,null,null,null,null,null,null,null,null,null,10,"SI.SH.CS",null,null,null,null,null,null,null,null,92,null,null,92]
["SH.CS.SO","Smart Handle Cover SO schmal",null,null,null,null,null,null,null,null,null,null,null,null,null,null,null,null,11,"SI.SH.CBP"]
["SH.CS.SO.105","Smart Handle Cover SO schmal 105",null,null,null,{"$f":"IF($J$3=\"Deutsch\",$B$84,IF($J$3=\"English\",$C$84,IF($J$3=\"Français\",$D$84,IF($J$3=\"Italiano\",$E$84,IF($J$3=\"Nederlands\",$F$84,\"\")))))","v":""},0,null,null,null,null,null,null,null,null,null,null,null,12,"SI.SH.CB"]
["SH.CSP","Smart Handle Cover schmal SC",null,null,null,{"$f":"IF($J$3=\"Deutsch\",$B$85,IF($J$3=\"English\",$C$85,IF($J$3=\"Français\",$D$85,IF($J$3=\"Italiano\",$E$85,IF($J$3=\"Nederlands\",$F$85,\"\")))))","v":""},2,null,null,null,null,null,null,null,null,null,null,null,13,"SI.SH.CSP","MO"]
["SH.CSP.X","Smart Handle Cover schmal SC 92",null,null,null,null,null,null,null,null,null,null,null,null,null,null,null,null,14,"SI.SH.CS","MO"]
["SH.CSP.SO","Smart Handle Cover schmal SC SO",null,null,null,{"$f":"IF($J$3=\"Deutsch\",$B$94,IF($J$3=\"English\",$C$94,IF($J$3=\"Français\",$D$94,IF($J$3=\"Italiano\",$E$94,IF($J$3=\"Nederlands\",$F$94,\"\")))))","v":""},1,0,null,null,null,null,null,null,null,null,null,null,15,"SI.SH.CBP","MO"]
["SH.CSP.SO.105","Smart Handle Cover SO schmal SC 105",null,null,null,{"$f":"IF($J$3=\"Deutsch\",$B$95,IF($J$3=\"English\",$C$95,IF($J$3=\"Français\",$D$95,IF($J$3=\"Italiano\",$E$95,IF($J$3=\"Nederlands\",$F$95,\"\")))))","v":""},2,3,null,null,null,null,null,null,null,null,null,null,16,"SI.SH.CB","MO"]
[null,null,null,null,null,null,null,null,null,null,null,null,null,null,null,null,null,null,17,"SI.SH2.CSP"]
[null,null,null,null,null,"Zeile 10",{"$f":"VLOOKUP(B9,$F$36:$G$38,2,FALSE)+VLOOKUP(C9,$F$40:$G$42,2,FALSE)+VLOOKUP(D9,$F$44:$G$45,2,FALSE)+VLOOKUP(G9,$F$47:$G$48,2,FALSE)+VLOOKUP(E9,$F$50:$G$51,2,FALSE)","v":{"$error":"#N/A"}},{"$f":"VLOOKUP($B9,$F$36:$H$38,3,FALSE)+VLOOKUP($D9,$F$44:$H$45,3,FALSE)+VLOOKUP($E9,$F$50:$H$51,3,FALSE)","v":{"$error":"#N/A"}},null,null,null,null,null,null,null,null,null,null,18,"SI.SH.CS"]
[null,null,null,null,null,"Zeile 11",{"$f":"VLOOKUP(B10,$F$36:$G$38,2,FALSE)+VLOOKUP(C10,$F$40:$G$42,2,FALSE)+VLOOKUP(D10,$F$44:$G$45,2,FALSE)+VLOOKUP(G10,$F$47:$G$48,2,FALSE)+VLOOKUP(E10,$F$50:$G$51,2,FALSE)","v":{"$error":"#N/A"}},{"$f":"VLOOKUP($B10,$F$36:$H$38,3,FALSE)+VLOOKUP($D10,$F$44:$H$45,3,FALSE)","v":{"$error":"#N/A"}},null,null,null,null,null,null,null,null,null,null,19,"SI.SH2.CBP"]
[null,null,null,null,null,"Zeile 12",{"$f":"VLOOKUP(B11,$F$36:$G$38,2,FALSE)+VLOOKUP(C11,$F$40:$G$42,2,FALSE)+VLOOKUP(D11,$F$44:$G$45,2,FALSE)+VLOOKUP(G11,$F$47:$G$48,2,FALSE)+VLOOKUP(E11,$F$50:$G$51,2,FALSE)","v":{"$error":"#N/A"}},{"$f":"VLOOKUP($B11,$F$36:$H$38,3,FALSE)+VLOOKUP($D11,$F$44:$H$45,3,FALSE)","v":{"$error":"#N/A"}},null,null,null,null,null,null,null,null,null,null,20,"SI.SH.CB"]
[null,null,null,null,null,"Zeile 13",{"$f":"VLOOKUP(B12,$F$36:$G$38,2,FALSE)+VLOOKUP(C12,$F$40:$G$42,2,FALSE)+VLOOKUP(D12,$F$44:$G$45,2,FALSE)+VLOOKUP(G12,$F$47:$G$48,2,FALSE)+VLOOKUP(E12,$F$50:$G$51,2,FALSE)","v":{"$error":"#N/A"}},{"$f":"VLOOKUP($B12,$F$36:$H$38,3,FALSE)+VLOOKUP($D12,$F$44:$H$45,3,FALSE)","v":{"$error":"#N/A"}},null,null,null,null,null,null,null,null,null,null,21,"SI.SH2.CSP","MO"]
[null,null,null,null,null,"Zeile 14",{"$f":"VLOOKUP(B13,$F$36:$G$38,2,FALSE)+VLOOKUP(C13,$F$40:$G$42,2,FALSE)+VLOOKUP(D13,$F$44:$G$45,2,FALSE)+VLOOKUP(G13,$F$47:$G$48,2,FALSE)+VLOOKUP(E13,$F$50:$G$51,2,FALSE)","v":{"$error":"#N/A"}},{"$f":"VLOOKUP($B13,$F$36:$H$38,3,FALSE)+VLOOKUP($D13,$F$44:$H$45,3,FALSE)","v":{"$error":"#N/A"}},null,null,null,null,null,null,null,null,null,null,22,"SI.SH.CS","MO"]
[null,null,null,null,null,null,null,null,null,null,null,null,null,null,null,null,null,null,23,"SI.SH2.CBP","MO"]
[null,null,null,null,null,null,null,null,null,null,null,null,null,null,null,null,null,null,24,"SI.SH.CB","MO"]
[null,null,null,null,null,null,null,null,null,null,null,null,null,null,null,null,null,null,25,"SI.SH.CS"]
[null,null,null,null,null,null,null,null,null,null,null,null,null,null,null,null,null,null,26,"SI.SH.CS"]
["Artikelnummer","Deutsch","English","Français","Italiano","Nederlands","Dansk",null,null,"für SmartHandle Zubehör",null,null,1,2,3,null,null,null,27,"SI.SH.CB"]
["Bestellhilfe für SmartHandle Cover","Bestellhilfe für SmartHandle Cover","ordering guide for SmartHandle cover","guide pour commander les plaques de Smart Handles","Guida all'ordine per le Cover delle SmartHandle","Bestelhulp voor SmartHandle schild","Orderguide for Smart Handle dækkappe",null,null,null,null,null,"SH.LEVA","SH.RING","SHGL08A72L",null,null,null,28,"SI.SH.CB"]
["Profil","Profil","Profile","Profils","Profilo","Profiel","Profil",null,null,{"$f":"H101","v":{"$error":"#N/A"}},1,null,"SH.LEVB",null,"SHGL08A72R",null,null,null,29,"SI.SH.CS.SR","MO"]
["Cover-Variante","Cover-Variante","Cover version",null,"Versione della cover","Schild variant","Dækkappe variant",null,null,{"$f":"H102","v":{"$error":"#N/A"}},2,null,"SH.LEVC",null,null,null,null,null,30,"SI.SH.CS.SR","MO"]
["Mechanical Override Ja/Nein","Mechanical Override Ja/Nein","mechanical override Yes/No","verrouillage mécanique Oui/Non","Override meccanico Si/No","Mechanical override Ja/Nee","Med mekanisk cylinder Ja/Nej",null,null,{"$f":"H103","v":{"$error":"#N/A"}},3,null,"SH.LEVD",null,null,null,null,null,31,"SI.SH.CB.SR","MO"]
["schmal / breit","schmal / breit","narrow /wide","étroit / large","Stretta/larga","smal / breed","Smal / Bred",null,null,null,null,null,"SH.LEVE",null,null,null,null,null,32,"SI.SH.CB.SR","MO"]
["Verkaufs-Artikelnummer","Verkaufs-Artikelnummer","part number","code article de commande","Codice prodotto","Artikelnummer","Produktnummer",null,null,null,null,null,"SH.LEVF",null,null,null,null,null,33,"SI.SH.CSP"]
["für Außenseite","für Außenseite","for outer side","pour côté extérieur","Per il lato esterno","voor buitenzijde","Udvendig",null,null,null,null,null,"SH.LEVG",null,null,null,null,null,34,"SI.SH.CS"]
["für Innenseite","für Innenseite","for inner side","pour côté intérieur","Per il lato interno","voor binnenzijde","Indvendig",null,null,null,null,null,"SH.LEVC.AB",null,null,null,null,null,35,"SI.SH.CBP"]
["sprechende Übersetzung der Verkaufsartikelnummer","sprechende Übersetzung der Verkaufsartikelnummer","detailed description of the part number","description du code article de commande","descrizione dettagliata del codice prodotto","omschrijving artikelnummer","Detaljeret beskrivelse af varen",null,null,null,null,null,null,null,null,null,null,null,36,"SI.SH.CB"]
["Bitte beachten Sie, dass das \"XX\" in der Artikelnummer durch die benötigte Entfernung ersetzt werden muss.","Bitte beachten Sie, dass das \"XX\" in der Artikelnummer durch die benötigte Entfernung ersetzt werden muss.","Please note that the \"XX\" in the part number is to be replaced by the distance required.","attention: le \"X\" est remplacé dans le code article par l'entraxe souhaité","Nota bene: la \"XX\" nel codice va sostituita con la misura richiesta","Let op: XX moet worden gewijzigd in de gewenste afstand","Venligst bemærk at \"XX\" i varenummeret skal erstattes af CC målet",null,null,null,null,null,null,null,null,null,null,null,37,"SI.SH.CSP.SR","MO"]
["Nicht alle der angezeigten Varianten sind auch bereits im Navision angelegt, können aber bei Bedarf angelegt werden!","Nicht alle der angezeigten Varianten sind auch bereits im Navision angelegt, können aber bei Bedarf angelegt werden!",null,null,null,null,null,null,null,"Zeile 19",{"$f":"VLOOKUP(B19,$J$64:$K$66,2,FALSE)","v":{"$error":"#N/A"}},null,null,null,null,null,null,null,38,"SI.SH.CS.SR","MO"]
["*** Bitte Makros aktivieren ***","*** Bitte Makros aktivieren ***","*** Please enable macros ***","activer les macros","*** Per favore attivate le macro ***","*** Macro’s inschakelen ***","***Venligst aktiver makroer***",null,null,"Zeile 20",{"$f":"VLOOKUP(B20,$J$64:$K$66,2,FALSE)","v":{"$error":"#N/A"}},null,null,null,null,null,null,null,39,"SI.SH.CBP.SR","MO"]
["Beispielfotos","Beispielfotos","illustrations","exemple d'illustration","illustrazioni","voorbeeldfoto’s","Billeder",null,null,"Zeile 21",{"$error":"#N/A"},null,null,null,null,null,null,null,40,"SI.SH.CB.SR","MO"]
["Euro-PZ","Euro-PZ","Euro profile","profil européen","Profilo europeo","Euro profiel ","Dråbecylinder",null,null,"Zeile 22",{"$error":"#N/A"},null,null,null,null,null,null,null,41,"SI.SH2.CSP"]
["Swiss Round","Swiss Round","Swiss Round","profil suisse rond","Tondo svizzero","Swiss Round","Swiss Round",null,null,"Zeile 23",{"$error":"#N/A"},null,null,null,null,null,null,null,42,"SI.SH.CS"]
["Scandinavian Oval","Scandinavian Oval","Scandinavian Oval","profil scandinave ovale","Ovale scandinavo","Scandinavian Oval","Skandinavisk Oval",null,null,null,null,null,null,null,null,null,null,null,43,"SI.SH2.CBP"]
["Aktiv","Aktiv","Active","actif","Attivo","Aktief","Aktiv",null,null,null,null,null,null,null,null,null,null,null,44,"SI.SH.CB"]
["integrierter Kartenleser","integrierter Kartenleser","card reader integrated","lecteur de cartes intégré","Lettore di carte integrato","Geïntegreerde kaartlezer","Integreret kortlæser",null,null,null,null,null,null,null,null,null,null,null,45,"SI.SH2.CSP.SR","MO"]
["reichweitenoptimierter Kartenleser","reichweitenoptimierter Kartenleser","card reader with improved reading distance integrated","lecteur de cartes avec portée optimisée","Lettore di carte con range esteso integrato","Geïntegreerde kaartlezer met verbeterde leesafstand","Integreret kortlæser med optimeret læseafstand",null,null,null,null,null,null,null,null,null,null,null,46,"SI.SH.CS.SR","MO"]
["Ja","Ja","Yes","Oui","Si","Ja","Ja",null,null,null,null,null,null,null,null,null,null,null,47,"SI.SH2.CBP.SR","MO"]
["Nein","Nein","No","Non","No","Nee","Nej",null,null,null,null,null,null,null,null,null,null,null,48,"SI.SH.CB.SR","MO"]
["schmal","schmal","narrow","étroit","stretta","smal  ","Smal",null,null,null,null,null,null,null,null,null,null,null,49,"SI.SH.CS.SO"]
["breit","breit","wide","large","larga","breed","Bred",null,null,null,null,null,null,null,null,null,null,null,50,"SI.SH.CS.SO"]
["Rückwärtssuche","Rückwärtssuche","reverse search","recherche arrière","ricerca inversa","omgekeerde zoekfunctie",null,null,null,null,null,null,null,null,null,null,null,null,51,"SI.SH.CB.SO"]
["Beispielfoto","Beispielfoto","illustration","exemple d'illustration","illustrazione","voorbeeldfoto’s","Billeder",null,null,null,null,null,null,null,null,null,null,null,52,"SI.SH.CB.SO"]
["Verkaufs-Artikelnummer (bitte auswählen)","Verkaufs-Artikelnummer (bitte auswählen)","part number (to be selected)","code article (à sélectionner)","codice prodotto ( da selezionare )","Artikelnummer (a.u.b. keuze maken)","Varenummer (Venligst vælg)",null,null,null,null,null,null,null,null,null,null,null,53,"SI.SH.CS.SO","MO"]
["zurück zur Hauptseite","zurück zur Hauptseite","back to main page","noch zu übersetzen","noch zu übersetzen","noch zu übersetzen","noch zu übersetzen",null,null,null,null,null,null,null,null,null,null,null,54,"SI.SH.CS.SO","MO",null,null,null,null,null,null,null,null,null,null,null,null,null,null,null,null,null,null,null,null,null,null,{"$f":"SI_Programming_Gateways!$J$235","v":"noch zu übersetzen"}]
["zurück zur Bestellhilfe für SmartHandle-Cover","zurück zur Bestellhilfe für SmartHandle-Cover","back to ordering guide for SmartHandle covers","retour au guide pour commander les plaques","ritorna alla guida per l'ordine delle cover per SmartHandle","Terug naar bestelhulp SmartHandle schilden","Retur til orderguide for Smart Handle dækkapper",null,null,null,null,null,null,null,null,null,null,null,55,"SI.SH.CB.SO","MO"]
["Kartenleseeinsatz steht 2mm hervor. \nAchtung, nicht kompatibel mit alter Version (bündiger Kartenlesereinsatz).","Kartenleseeinsatz steht 2mm hervor. \nAchtung, nicht kompatibel mit alter Version (bündiger Kartenlesereinsatz).","the card reader insert protrudes 2mm. \nPlease note that this version is not compatible with the flush-mounted version.","lecteur carte dépassant de 2 mm - cette version n'est pas compatible avec l'ancienne","L'inserto per la lettura delle tessere sporge per 2 mm. Nota bene: questa versione non è compatibile con la versione con montaggio a filo","de opbouw kaartlezer steekt 2mm uit. Let op deze versie is niet compatibel met de inbouw versie.","Bemærk: Kortlæseren har et fremspring på 2mm. Dækkappen er ikke kompatibel til versioner uden dette fremspring (gammel version).",null,null,null,null,null,null,null,null,null,null,null,56,"SI.SH.CB.SO","MO"]
["Kartenleseeinsatz ist bündig. \nAchtung, nicht kompatibel mit neuem Cover (hervorstehender Kartenlesereinsatz).","Kartenleseeinsatz ist bündig. \nAchtung, nicht kompatibel mit neuem Cover (hervorstehender Kartenlesereinsatz).","The card reader insert is flush-mounted. \nPlease note that this version is not compatible with the new version (protruded card reader insert).","lecteur carte ancienne version - cette version n'est pas compatible avec la nouvelle (lecteur carte dépassant de 2 mm)","L'inserto per la lettura delle tessere e montato a filo. Nota bene: questa versione non è compatibile con la nuova versione ( inserto per la lettura sporgente )","Inbouw kaartlezer. Let op deze versie is niet compatibel met de nieuwe opbouw lezer versie","Bemærk: Kortlæseren har ikke et fremspring. Dækkappen er ikke kompatibel til versioner med fremspring (ny version).",null,null,null,null,null,null,null,null,null,null,null,57,"SI.SH.CSP.SO"]
["außen / innen","außen / innen","outside / Inside","noch zu übersetzen","noch zu übersetzen","noch zu übersetzen","noch zu übersetzen",null,null,null,null,null,null,null,null,null,null,null,58,"SI.SH.CS.SO"]
["außen","außen","outside","noch zu übersetzen","noch zu übersetzen","noch zu übersetzen",33,null,null,null,null,null,null,null,null,null,null,null,59,"SI.SH.CBP.SO"]
["innen","innen","inside","noch zu übersetzen","noch zu übersetzen","noch zu übersetzen",34,null,null,null,null,null,null,null,null,null,null,null,60,"SI.SH.CB.SO"]
["kpl. Artikelnummer","kpl. Artikelnummer","Complete Part Number","Code article complet","Complete onderdeel nummer","Komplet varenummer",35,null,null,null,null,null,null,null,null,null,null,null,61,"SI.SH.CSP.SO","MO"]
["Anzahl","Anzahl","Quantity","Quantité","Aantal","Antal",36,null,null,null,null,null,null,null,null,null,null,null,62,"SI.SH.CS.SO","MO"]
["entfällt","entfällt","not applicable","noch zu übersetzen","noch zu übersetzen","noch zu übersetzen",37,{"$f":"HLOOKUP('Hauptseite - main page'!G3,'SmartHandle Cover - order tool'!B62:G98,37)","v":{"$error":"#N/A"}},null,null,null,null,null,null,null,null,null,null,63,"SI.SH.CBP.SO","MO"]
["Entfernung","Entfernung","Centre Distance","Distance","Interasse","H.O.H. maat","Centerafstand",null,null,null,null,null,null,null,null,null,null,null,64,"SI.SH.CB.SO","MO"]
["SmartHandle - Zubehör","SmartHandle - Zubehör","SmartHandle - Assessories","noch zu übersetzen","noch zu übersetzen","noch zu übersetzen","noch zu übersetzen",{"$f":"HLOOKUP('Hauptseite - main page'!G3,'SmartHandle Cover - order tool'!B62:G100,39)","v":{"$error":"#N/A"}},null,null,null,null,null,null,null,null,null,null,65,"SI.SH2.CSP.SO"]
["Drücker","Drücker","handles","noch zu übersetzen","noch zu übersetzen","noch zu übersetzen","noch zu übersetzen",{"$f":"HLOOKUP('Hauptseite - main page'!G3,'SmartHandle Cover - order tool'!B62:G101,40)","v":{"$error":"#N/A"}},null,null,null,null,null,null,null,null,null,null,66,"SI.SH.CS.SO"]
["Verschlussring","Verschlussring","lock ring","noch zu übersetzen","noch zu übersetzen","noch zu übersetzen","noch zu übersetzen",{"$f":"HLOOKUP('Hauptseite - main page'!$G$3,'SmartHandle Cover - order tool'!$B$62:$G$140,41)","v":{"$error":"#N/A"}},null,null,null,null,null,null,null,null,null,null,67,"SI.SH2.CBP.SO"]
["Schlosskasten für Glastüren","Schlosskasten für Glastüren","SmartIntego for glass doors","noch zu übersetzen","noch zu übersetzen","noch zu übersetzen","noch zu übersetzen",{"$f":"HLOOKUP('Hauptseite - main page'!$G$3,'SmartHandle Cover - order tool'!$B$62:$G$140,42)","v":{"$error":"#N/A"}},null,null,null,null,null,null,null,null,null,null,68,"SI.SH.CB.SO"]
["SmartHandle-Drücker zur Nach- bzw. Umrüstung, L-Form rund gebogen, Innen- und Außendrücker, mit Verschlussring und Inbusschraube","SmartHandle-Drücker zur Nach- bzw. Umrüstung, L-Form rund gebogen, Innen- und Außendrücker, mit Verschlussring und Inbusschraube","SmartHandle for retrofit or conversion, L-shape, round, curved, inside and outer handles, with lock ring and socket screw",null,null,null,43,{"$f":"HLOOKUP('Hauptseite - main page'!$G$3,'SmartHandle Cover - order tool'!$B$62:$G$140,43)","v":{"$error":"#N/A"}},null,null,null,null,null,null,null,null,null,null,69,"SI.SH2.CSP.SO","MO"]
["SmartHandle-Drücker zur Nach- bzw. Umrüstung, L-Form auf Gehrung, Innen- und Außendrücker, mit Verschlussring und Inbusschraube","SmartHandle-Drücker zur Nach- bzw. Umrüstung, L-Form auf Gehrung, Innen- und Außendrücker, mit Verschlussring und Inbusschraube","SmartHandle for retrofit or conversion, L-shape with mitre, Inside and outer handles, with lock ring and socket screw",null,null,null,44,{"$f":"HLOOKUP('Hauptseite - main page'!$G$3,'SmartHandle Cover - order tool'!$B$62:$G$140,44)","v":{"$error":"#N/A"}},null,null,null,null,null,null,null,null,null,null,70,"SI.SH.CS.SO","MO"]
["SmartHandle-Drücker zur Nach- bzw. Umrüstung, U-Form rund gebogen, Innen- und Außendrücker, mit Verschlussring ","SmartHandle-Drücker zur Nach- bzw. Umrüstung, U-Form rund gebogen, Innen- und Außendrücker, mit Verschlussring ","SmartHandle for retrofit or conversion, U-shaped, round, curved, inside and outer handles, with lock ring ",null,null,null,45,{"$f":"HLOOKUP('Hauptseite - main page'!$G$3,'SmartHandle Cover - order tool'!$B$62:$G$140,45)","v":{"$error":"#N/A"}},null,null,null,null,null,null,null,null,null,null,71,"SI.SH2.CBP.SO","MO"]
["SmartHandle-Drücker zur Nach- bzw. Umrüstung, U-Form auf Gehrung, Innen- und Außendrücker, mit Verschlussring und Inbusschraube","SmartHandle-Drücker zur Nach- bzw. Umrüstung, U-Form auf Gehrung, Innen- und Außendrücker, mit Verschlussring und Inbusschraube","SmartHandle for retrofit or conversion, U-shaped with mitre, inside and outer handles, with lock ring and socket screw",null,null,null,46,{"$f":"HLOOKUP('Hauptseite - main page'!$G$3,'SmartHandle Cover - order tool'!$B$62:$G$140,46)","v":{"$error":"#N/A"}},null,null,null,null,null,null,null,null,null,null,72,"SI.SH.CB.SO","MO"]
["SmartHandle-Drücker zur Nach- bzw. Umrüstung, U-Form rund gebogen, gekröpft, für Rohrrahmentüren, Innen- und Außendrücker, mit Verschlussring und Inbusschraube","SmartHandle-Drücker zur Nach- bzw. Umrüstung, U-Form rund gebogen, gekröpft, für Rohrrahmentüren, Innen- und Außendrücker, mit Verschlussring und Inbusschraube","SmartHandle for retrofit or conversion, U-shaped, round, offset, for metal frame doors, Inside and outer handles, with lock ring and socket screw",null,null,null,47,{"$f":"HLOOKUP('Hauptseite - main page'!$G$3,'SmartHandle Cover - order tool'!$B$62:$G$140,47)","v":{"$error":"#N/A"}}]
["SmartHandle-Drücker zur Nach- bzw. Umrüstung, U-Form auf Gehrung, gekröpft, für Rohrrahmentüren, Innen- und Außendrücker, mit Verschlussring und Inbusschraube","SmartHandle-Drücker zur Nach- bzw. Umrüstung, U-Form auf Gehrung, gekröpft, für Rohrrahmentüren, Innen- und Außendrücker, mit Verschlussring und Inbusschraube","SmartHandle for retrofit or conversion, U-shaped with mitre, offset, for metal frame doors, Inside and outer handles, With lock ring and socket screw",null,null,null,48,{"$f":"HLOOKUP('Hauptseite - main page'!$G$3,'SmartHandle Cover - order tool'!$B$62:$G$140,48)","v":{"$error":"#N/A"}}]
["SmartHandle-Drücker zur Nach- bzw. Umrüstung, Design Ulmer Klinke, Innen- und Außendrücker, mit Verschlussring und Inbusschraube","SmartHandle-Drücker zur Nach- bzw. Umrüstung, Design Ulmer Klinke, Innen- und Außendrücker, mit Verschlussring und Inbusschraube","SmartHandle for retrofit or conversion, Ulmer door fitting design, Inside and outer handles, With lock ring and socket screw",null,null,null,49,{"$f":"HLOOKUP('Hauptseite - main page'!$G$3,'SmartHandle Cover - order tool'!$B$62:$G$140,49)","v":{"$error":"#N/A"}}]
["SmartHandle-Drücker zur Nach- bzw. Umrüstung","SmartHandle-Drücker zur Nach- bzw. Umrüstung","SmartHandle for retrofit or conversion",null,null,null,50,{"$f":"HLOOKUP('Hauptseite - main page'!$G$3,'SmartHandle Cover - order tool'!$B$62:$G$140,50)","v":{"$error":"#N/A"}}]
["Verschlussring für wechselbaren Außendrücker beim SmartHandle :: Inhalt: 10 Stück","Verschlussring für wechselbaren Außendrücker beim SmartHandle :: Inhalt: 10 Stück","Lock ring for interchangeable outer handle for SmartHandle\n:: Contents: 10 units",null,null,null,51,{"$f":"HLOOKUP('Hauptseite - main page'!$G$3,'SmartHandle Cover - order tool'!$B$62:$G$140,51)","v":{"$error":"#N/A"}}]
["SmartHandle - SmartIntego für Glastüren,DIN links,Vierkant 8 mm,für Glastüren vorgerichtet mit vertikalen Bohrungen im Abstand von 80 mm,Lochdurchmesser 50 mm, Glastürschloss nach DIN 18251, Glasdicke 8 mm, Abmessungen (HxB) ca. 245 x 94 mm, SmartHandle - SmartIntego SnapIn muss extra bestellt werden","SmartHandle - SmartIntego für Glastüren,DIN links,Vierkant 8 mm,für Glastüren vorgerichtet mit vertikalen Bohrungen im Abstand von 80 mm,Lochdurchmesser 50 mm, Glastürschloss nach DIN 18251, Glasdicke 8 mm, Abmessungen (HxB) ca. 245 x 94 mm, SmartHandle - SmartIntego SnapIn muss extra bestellt werden","SmartHandle – SmartIntego for glass doors,DIN left-hand:,Spindle, 8 mm, designed for glass doors with vertical holes at a gap of 80 mm, hole diameter,50 mm, glass door lock as per DIN 18251:,Glass 8 mm thick, dimensions (H x W) about 245 x 94 mm, SmartHandle – SmartIntego Snap-in must be ordered separately",null,null,null,52,{"$f":"HLOOKUP('Hauptseite - main page'!$G$3,'SmartHandle Cover - order tool'!$B$62:$G$140,52)","v":{"$error":"#N/A"}}]
["SmartHandle - SmartIntego für Glastüren, DIN rechts, Vierkant 8 mm, für Glastüren vorgerichtet mit vertikalen Bohrungen im Abstand von 80 mm, Lochdurchmesser 50 mm, Glastürschloss nach DIN 18251, Glasdicke 8 mm, Abmessungen (HxB) ca. 245 x 94 mm, SmartHandle - SmartIntego SnapIn muss extra bestellt werden","SmartHandle - SmartIntego für Glastüren, DIN rechts, Vierkant 8 mm, für Glastüren vorgerichtet mit vertikalen Bohrungen im Abstand von 80 mm, Lochdurchmesser 50 mm, Glastürschloss nach DIN 18251, Glasdicke 8 mm, Abmessungen (HxB) ca. 245 x 94 mm, SmartHandle - SmartIntego SnapIn muss extra bestellt werden","SmartHandle – SmartIntego for glass doors, DIN right-hand, Spindle, 8 mm, Designed for glass doors with vertical holes at a gap of 80 mm, Hole diameter: 50 mm, Glass door lock as per DIN 18251, Glass 8 mm thick, Dimensions (H x W) about 245 x 94 mm, SmartHandle – SmartIntego Snap-in must be ordered separately",null,null,null,53,{"$f":"HLOOKUP('Hauptseite - main page'!$G$3,'SmartHandle Cover - order tool'!$B$62:$G$140,53)","v":{"$error":"#N/A"}}]
[null,null,null,null,null,null,54]
[]
[]
[]
[]
[]
[]
[]
[]
[]
[]
[1,null,"SH.LEVA",{"$f":"H104","v":{"$error":"#N/A"}}]
[2,null,"SH.LEVB",{"$f":"H105","v":{"$error":"#N/A"}}]
[3,null,"SH.LEVC",{"$error":"#N/A"}]
[4,null,"SH.LEVD",{"$error":"#N/A"}]
[5,null,"SH.LEVE",{"$error":"#N/A"}]
[6,null,"SH.LEVF",{"$error":"#N/A"}]
[7,null,"SH.LEVG",{"$error":"#N/A"}]
[8,null,"SH.LEVC.AB",{"$error":"#N/A"}]
[9,null,"SH.RING",{"$error":"#N/A"}]
[10,null,"SHGL08A72L",{"$error":"#N/A"}]
[11,null,"SHGL08A72R",{"$error":"#N/A"}]
[12]
[13]
[14]
[15]
[16]
[17]
[18]
[19]
[20]
[21]
[22]
[23]
[24]
[25]
[26]
[27]
[28]
[29]
[30]
[31]
[32]
[33]
[34]
[35]
[36]
[37]
[38]
[39]
[40]
[41]
[42]
[43]
[44]
[45]
[46]
[47]
[48]
[49]
[50]
[51]
[52]
[53]
[54]
[55]
[56]
[57]
[58]
[59]
[60]
[61]
[62]
[63]
[64]
[65]
[66]
[67]
[68]
[69]
[70]
[71]
[72]
[73]
[74]
[75]
[76]
[77]
[78]
[79]
[80]
[81]
[82]
[83]
[84]
[85]
[86]
[87]
[88]
[89]
[90]
[91]
[92]
[93]
[94]
[95]
[96]
[97]
[98]
[99]
[100]
[101]
[102]
[103]
[104]
[105]
[106]
[107]
[108]
[109]
[110]
[111]
[112]
[113]
[114]
[115]
[116]
[117]
[118]
[119]
[120]
[121]
[122]
[123]
[124]
[125]
[126]
[127]
[128]
[129]
[130]
[131]
[132]
[133]
[134]
[135]
[136]
[137]
[138]
[139]
[140]
[141]
[142]
[143]
[144]
[145]
[146]
[147]
[148]
[149]
[150]
[151]
[152]
[153]
[154]
[155]
[156]
[157]
[158]
[159]
[160]
[161]
[162]
[163]
[164]
[165]
[166]
[167]
[168]
[169]
[170]
[171]
[172]
[173]
[174]
[175]
[176]
[177]
[178]
[179]
[180]
[181]
[182]
[183]
[184]
[185]
[186]
[187]
[188]
[189]
[190]
[191]
[192]
[193]
[194]
[195]
[196]
[197]
[198]
[199]
[200]

{"sheet":"SmartHandle Cover - overview","index":6,"n_rows":111,"n_cols":48,"rows_kept":111,"cut":false,"hidden":true,"merged":[[9,4,9,5],[12,0,12,5],[14,4,14,5],[15,3,15,4],[1,3,1,5],[3,3,3,5],[6,0,7,0],[6,1,7,1],[6,2,7,2],[6,3,7,3],[6,4,6,5]]}
[]
[]
[{"$f":"HLOOKUP($I$3,$A$58:$F$110,2,0)","v":{"$error":"#N/A"}},null,null,null,null,null,null,null,{"$f":"'Hauptseite - main page'!G3","v":"Dansk"}]
[]
[]
[]
[{"$f":"HLOOKUP($I$3,$A$58:$F$110,3,0)","v":{"$error":"#N/A"}},{"$f":"HLOOKUP($I$3,$A$58:$F$110,4,0)","v":{"$error":"#N/A"}},{"$f":"HLOOKUP($I$3,$A$58:$F$110,5,0)","v":{"$error":"#N/A"}},{"$f":"HLOOKUP($I$3,$A$58:$F$110,6,0)","v":{"$error":"#N/A"}},{"$f":"HLOOKUP($I$3,$A$58:$F$110,7,0)","v":{"$error":"#N/A"}}]
[null,null,null,null,{"$f":"HLOOKUP($I$3,$A$58:$F$110,8,0)","v":{"$error":"#N/A"}},{"$f":"HLOOKUP($I$3,$A$58:$F$110,9,0)","v":{"$error":"#N/A"}}]
[null,null,null,null,{"$f":"IF(OR(A9=\"\",B9=\"\",C9=\"\",D9=\"\"),\"XXX\",CHOOSE(F46,B28,C28,D28,E28,F28,G28,H28,I28,J28,K28,L28,M28,N28,O28,P28,Q28,R28,S28,T28,U28,V28,W28,X28,Y28,Z28,AA28,AB28,AC28,AD28,AE28,AF28,AG28,AH28,AI28,AJ28,AK28,AL28,AM28,AN28,AO28,AP28,AQ28,AR28,AS28,AT28,AU28,AV28))","v":"XXX"},{"$f":"IF(OR(A9=\"\",B9=\"\",C9=\"\",D9=\"\"),\"XXX\",CHOOSE(F46,B29,C29,D29,E29,F29,G29,H29,I29,J29,K29,L29,M29,N29,O29,P29,Q29,R29,S29,T29,U29,V29,W29,X29,Y29,Z29,AA29,AB29,AC29,AD29,AE29,AF29,AG29,AH29,AI29,AJ29,AK29,AL29,AM29,AN29,AO29,AP29,AQ29,AR29,AS29,AT29,AU29,AV29))","v":"XXX"}]
[null,null,null,null,{"$f":"IF(E9<>\"\",HLOOKUP($I$3,$A$58:$F$110,14,0),\"\")","v":{"$error":"#N/A"}}]
[null,null," "]
[null,null,null,null,{"$f":"IF(AND(B9=HLOOKUP($I$3,$A$58:$F$110,20,0),E9<>\"XXX\"),HLOOKUP($I$3,$A$58:$F$110,30,0),IF(AND(B9=HLOOKUP($I$3,$A$58:$F$110,19,0),E9<>\"XXX\"),HLOOKUP($I$3,$A$58:$F$110,31,0),\"\"))","v":{"$error":"#N/A"}}]
[]
[{"$f":"HLOOKUP($I$3,$A$58:$F$110,25,0)","v":{"$error":"#N/A"}},{"$f":"IF(B16=\"XXX\",\"XXX\",A16)","v":"XXX"}]
[{"$f":"HLOOKUP($I$3,$A$58:$F$110,27,0)","v":{"$error":"#N/A"}},{"$f":"HLOOKUP($I$3,$A$58:$F$110,10,0)","v":{"$error":"#N/A"}},{"$f":"HLOOKUP($I$3,$A$58:$F$110,26,0)","v":{"$error":"#N/A"}}]
[null,{"$f":"IF(A16<>\"\",VLOOKUP(A16,Langtext_Cover_Übers.!A1:B40,2,FALSE),\"XXX\")","v":"XXX"},null,{"$f":"IF(OR(A16=\"SH.CBP\",A16=\"SH.CBP.SO\",A16=\"SH.CBP.SO.105\",A16=\"SH.CBP.SR\",A16=\"SH.CBP.SR.A78\",A16=\"SH.CBP.X\",A16=\"SH.CSP\",A16=\"SH.CSP.SO\",A16=\"SH.CSP.SO.105\",A16=\"SH.CSP.SR\",A16=\"SH.CSP.SR.A78\",A16=\"SH.CSP.X\"),HLOOKUP($E$3,$A$58:$F$110,31,0),IF(OR(A16=\"SH2.CBP\",A16=\"SH2.CBP.SO\",A16=\"SH2.CBP.SO.105\",A16=\"SH2.CBP.SR\",A16=\"SH2.CBP.SR.A78\",A16=\"SH2.CBP.X\",A16=\"SH2.CSP\",A16=\"SH2.CSP.SO\",A16=\"SH2.CSP.SO.105\",A16=\"SH2.CSP.SR\",A16=\"SH2.CSP.SR.A78\",A16=\"SH2.CSP.X\"),HLOOKUP($E$3,$A$58:$F$110,30,0),\"\"))","v":""}]
[]
[]
[]
[]
[]
[]
[]
[]
[{"$f":"IF(B16=\"XXX\",\"XXX\",A16)","v":"XXX"}]
[]
[null,1,2,3,4,5,6,7,8,9,10,11,12,13,14,15,16,17,18,19,20,21,22,23,24,25,26,27,28,29,30,31,32,33,34,35,36,37,38,39,40,41,42,43,44,45,46,47]
["für Außenseite","SI.SH.CS","SI.SH.CSP","SI.SH.CS.XX","SI.SH.CSP.XX","SI.SH.CB","SI.SH.CBP","SI.SH.CB.XX","SI.SH.CBP.XX","SI.SH.CS.SO","SI.SH.CSP.SO","SI.SH.CS.SO.105","SI.SH.CSP.SO.105","SI.SH.CB.SO","SI.SH.CBP.SO","SI.SH.CB.SO.105","SI.SH.CBP.SO.105","SI.SH.CS","SI.SH.CSP","SI.SH.CS.SR.A78","SI.SH.CSP.SR.A78","SI.SH.CB","SI.SH.CBP","SI.SH.CB.SR.A78","SI.SH.CBP.SR.A78","SI.SH2.CSP","nicht vorhanden","SI.SH2.CSP.XX","nicht vorhanden","SI.SH2.CBP","nicht vorhanden","SI.SH2.CBP.XX","nicht vorhanden","SI.SH2.CSP.SO","nicht vorhanden","SI.SH2.CSP.SO.105","nicht vorhanden","SI.SH2.CBP.SO","nicht vorhanden","SI.SH2.CBP.SO.105","nicht vorhanden","SI.SH2.CSP","nicht vorhanden","SI.SH2.CSP.SR.A78","nicht vorhanden","SI.SH2.CBP","nicht vorhanden","SI.SH2.CBP.SR.A78"]
["für Innenseite","SI.SH.CS","SI.SH.CS","SI.SH.CS.XX","SI.SH.CS.XX","SI.SH.CB","SI.SH.CB","SI.SH.CB.XX","SI.SH.CB.XX","SI.SH.CS.SO","SI.SH.CS.SO","SI.SH.CS.SO.105","SI.SH.CS.SO.105","SI.SH.CB.SO","SI.SH.CB.SO","SI.SH.CB.SO.105","SI.SH.CB.SO.105","SI.SH.CS","SI.SH.CS","SI.SH.CS.SR.I78","SI.SH.CS.SR.I78","SI.SH.CB","SI.SH.CB","SI.SH.CB.SR.I78","SI.SH.CB.SR.I78","SI.SH.CS","nicht vorhanden","SI.SH.CS.XX","nicht vorhanden","SI.SH.CB","nicht vorhanden","SI.SH.CB.XX","nicht vorhanden","SI.SH.CS.SO","nicht vorhanden","SI.SH.CS.SO.105","nicht vorhanden","SI.SH.CB.SO","nicht vorhanden","SI.SH.CB.SO.105","nicht vorhanden","SI.SH.CS","nicht vorhanden","SI.SH.CS.SR.I78","nicht vorhanden","SI.SH.CB","nicht vorhanden","SI.SH.CB.SR.I78"]
[]
[]
[null,null,null,null,{"$f":"IF($I$3=\"Deutsch\",$B$72,IF($I$3=\"English\",$C$72,IF($I$3=\"Français\",$D$72,IF($I$3=\"Italiano\",$E$72,IF($I$3=\"Nederlands\",$F$72,\"\")))))","v":""},0]
["Nr.","Beschreibung",null,null,{"$f":"IF($I$3=\"Deutsch\",$B$73,IF($I$3=\"English\",$C$73,IF($I$3=\"Français\",$D$73,IF($I$3=\"Italiano\",$E$73,IF($I$3=\"Nederlands\",$F$73,\"\")))))","v":""},16]
["SH.CB","Smart Handle Cover breit",null,null,{"$f":"IF($I$3=\"Deutsch\",$B$74,IF($I$3=\"English\",$C$74,IF($I$3=\"Français\",$D$74,IF($I$3=\"Italiano\",$E$74,IF($I$3=\"Nederlands\",$F$74,\"\")))))","v":""},8]
["SH.CB.X","Smart Handle Cover breit 72"]
["SH.CB.SO.105","Smart Handle Cover SO breit 105",null,null,{"$f":"IF($I$3=\"Deutsch\",$B$75,IF($I$3=\"English\",$C$75,IF($I$3=\"Français\",$D$75,IF($I$3=\"Italiano\",$E$75,IF($I$3=\"Nederlands\",$F$75,\"\")))))","v":""},0]
["SH.CBP","Smart Handle Cover breit SC",null,null,{"$f":"IF($I$3=\"Deutsch\",$B$76,IF($I$3=\"English\",$C$76,IF($I$3=\"Français\",$D$76,IF($I$3=\"Italiano\",$E$76,IF($I$3=\"Nederlands\",$F$76,\"\")))))","v":""},1]
["SH.CBP.X","Smart Handle Cover breit SC 72",null,null,{"$f":"IF($I$3=\"Deutsch\",$B$77,IF($I$3=\"English\",$C$77,IF($I$3=\"Français\",$D$77,IF($I$3=\"Italiano\",$E$77,IF($I$3=\"Nederlands\",$F$77,\"\")))))","v":""},24]
["SH.CBP.SO.105","Smart Handle Cover SO breit SC 105"]
["SH.CS","Smart Handle Cover schmal",null,"Mechanical Override",{"$f":"IF($I$3=\"Deutsch\",$B$78,IF($I$3=\"English\",$C$78,IF($I$3=\"Français\",$D$78,IF($I$3=\"Italiano\",$E$78,IF($I$3=\"Nederlands\",$F$78,\"\")))))","v":""},2]
["SH.CS.X","Smart Handle Cover schmal 72",null,"Mechanical Override",{"$f":"IF($I$3=\"Deutsch\",$B$79,IF($I$3=\"English\",$C$79,IF($I$3=\"Français\",$D$79,IF($I$3=\"Italiano\",$E$79,IF($I$3=\"Nederlands\",$F$79,\"\")))))","v":""},0]
["SH.CS.SO","Smart Handle Cover SO schmal"]
["SH.CS.SO.105","Smart Handle Cover SO schmal 105",null,null,{"$f":"IF($I$3=\"Deutsch\",$B$80,IF($I$3=\"English\",$C$80,IF($I$3=\"Français\",$D$80,IF($I$3=\"Italiano\",$E$80,IF($I$3=\"Nederlands\",$F$80,\"\")))))","v":""},1]
["SH.CSP","Smart Handle Cover schmal SC",null,null,{"$f":"IF($I$3=\"Deutsch\",$B$81,IF($I$3=\"English\",$C$81,IF($I$3=\"Français\",$D$81,IF($I$3=\"Italiano\",$E$81,IF($I$3=\"Nederlands\",$F$81,\"\")))))","v":""},5]
["SH.CSP.X","Smart Handle Cover schmal SC 92"]
["SH.CSP.SO","Smart Handle Cover schmal SC SO",null,null,"Summe",{"$f":"VLOOKUP(A9,E32:F34,2,FALSE)+VLOOKUP(B9,E36:F38,2,FALSE)+VLOOKUP(C9,E40:F41,2,FALSE)+VLOOKUP(D9,E43:F44,2,FALSE)","v":{"$error":"#N/A"}}]
["SH.CSP.SO.105","Smart Handle Cover SO schmal SC 105"]
[]
[]
[]
[]
[]
[]
[]
[]
[]
[]
["Artikelnummer","Deutsch","English","Français","Italiano","Nederlands",1]
["Bestellhilfe für SmartHandle Cover","Bestellhilfe für SmartHandle Cover","ordering guide for SmartHandle cover","guide pour commander les plaques de Smart Handles","Guida all'ordine per le Cover delle SmartHandle","Bestelhulp voor SmartHandle schild","Orderguide for Smart Handle dækkappe"]
["Profil","Profil","Profile","Profils","Profilo","Profiel","Profil"]
["Cover-Variante","Cover-Variante","Cover version",null,"Versione della cover","Schild variant","Dækkappe variant"]
["Mechanical Override Ja/Nein","Mechanical Override Ja/Nein","mechanical override Yes/No","verrouillage mécanique Oui/Non","Override meccanico Si/No","Mechanical override Ja/Nee","Med mekanisk cylinder Ja/Nej"]
["schmal / breit","schmal / breit","narrow /wide","étroit / large","Stretta/larga","smal / breed","Smal / Bred"]
["Verkaufs-Artikelnummer","Verkaufs-Artikelnummer","part number","code article de commande","Codice prodotto","Artikelnummer","Produktnummer"]
["für Außenseite","für Außenseite","for outer side","pour côté extérieur","Per il lato esterno","voor buitenzijde","Udvendig"]
["für Innenseite","für Innenseite","for inner side","pour côté intérieur","Per il lato interno","voor binnenzijde","Indvendig"]
["sprechende Übersetzung der Verkaufsartikelnummer","sprechende Übersetzung der Verkaufsartikelnummer","detailed description of the part number","description du code article de commande","descrizione dettagliata del codice prodotto","omschrijving artikelnummer","Detaljeret beskrivelse af varen"]
["Bitte beachten Sie, dass das \"XX\" in der Artikelnummer durch die benötigte Entfernung ersetzt werden muss.","Bitte beachten Sie, dass das \"XX\" in der Artikelnummer durch die benötigte Entfernung ersetzt werden muss.","Please note that the \"XX\" in the part number is to be replaced by the distance required.","attention: le \"X\" est remplacé dans le code article par l'entraxe souhaité","Nota bene: la \"XX\" nel codice va sostituita con la misura richiesta","Let op: XX moet worden gewijzigd in de gewenste afstand","Venligst bemærk at \"XX\" i varenummeret skal erstattes af CC målet"]
["Nicht alle der angezeigten Varianten sind auch bereits im Navision angelegt, können aber bei Bedarf angelegt werden!","Nicht alle der angezeigten Varianten sind auch bereits im Navision angelegt, können aber bei Bedarf angelegt werden!"]
["*** Bitte Makros aktivieren ***","*** Bitte Makros aktivieren ***","*** Please enable macros ***","activer les macros","*** Per favore attivate le macro ***","*** Macro’s inschakelen ***","***Venligst aktiver makroer***"]
["Beispielfotos","Beispielfotos","illustrations","exemple d'illustration","illustrazioni","voorbeeldfoto’s","Billeder"]
["Euro-PZ","Euro-PZ","Euro profile","profil européen","Profilo europeo","Euro profiel ","Dråbecylinder"]
["Swiss Round","Swiss Round","Swiss Round","profil suisse rond","Tondo svizzero","Swiss Round","Swiss Round"]
["Scandinavian Oval","Scandinavian Oval","Scandinavian Oval","profil scandinave ovale","Ovale scandinavo","Scandinavian Oval","Skandinavisk Oval"]
["Aktiv","Aktiv","Active","actif","Attivo","Aktief","Aktiv"]
["integrierter Kartenleser","integrierter Kartenleser","card reader integrated","lecteur de cartes intégré","Lettore di carte integrato","Geïntegreerde kaartlezer","Integreret kortlæser"]
["reichweitenoptimierter Kartenleser","reichweitenoptimierter Kartenleser","card reader with improved reading distance integrated","lecteur de cartes avec portée optimisée","Lettore di carte con range esteso integrato","Geïntegreerde kaartlezer met verbeterde leesafstand","Integreret kortlæser med optimeret læseafstand"]
["Ja","Ja","Yes","Oui","Si","Ja","Ja"]
["Nein","Nein","No","Non","No","Nee","Nej"]
["schmal","schmal","narrow","étroit","stretta","smal  ","Smal"]
["breit","breit","wide","large","larga","breed","Bred"]
["Rückwärtssuche","Rückwärtssuche","reverse search","recherche arrière","ricerca inversa","omgekeerde zoekfunctie"]
["Beispielfoto","Beispielfoto","illustration","exemple d'illustration","illustrazione","voorbeeldfoto’s","Billeder"]
["Verkaufs-Artikelnummer (bitte auswählen)","Verkaufs-Artikelnummer (bitte auswählen)","part number (to be selected)","code article (à sélectionner)","codice prodotto ( da selezionare )","Artikelnummer (a.u.b. keuze maken)","Varenummer (Venligst vælg)"]
["zurück zur Hauptseite","zurück zur Hauptseite","back to main page","noch zu übersetzen","noch zu übersetzen","noch zu übersetzen","noch zu übersetzen",null,null,null,null,null,null,null,null,null,null,null,null,null,null,null,null,null,null,null,null,null,null,null,null,null,null,null,null,null,null,null,null,null,null,null,null,null,null,{"$f":"SI_Programming_Gateways!$J$235","v":"noch zu übersetzen"}]
["zurück zur Bestellhilfe für SmartHandle-Cover","zurück zur Bestellhilfe für SmartHandle-Cover","back to ordering guide for SmartHandle covers","retour au guide pour commander les plaques","ritorna alla guida per l'ordine delle cover per SmartHandle","Terug naar bestelhulp SmartHandle schilden","Retur til orderguide for Smart Handle dækkapper"]
["Kartenleseeinsatz steht 2mm hervor. \nAchtung, nicht kompatibel mit alter Version (bündiger Kartenlesereinsatz).","Kartenleseeinsatz steht 2mm hervor. \nAchtung, nicht kompatibel mit alter Version (bündiger Kartenlesereinsatz).","the card reader insert protrudes 2mm. \nPlease note that this version is not compatible with the flush-mounted version.","lecteur carte dépassant de 2 mm - cette version n'est pas compatible avec l'ancienne","L'inserto per la lettura delle tessere sporge per 2 mm. Nota bene: questa versione non è compatibile con la versione con montaggio a filo","de opbouw kaartlezer steekt 2mm uit. Let op deze versie is niet compatibel met de inbouw versie.","Bemærk: Kortlæseren har et fremspring på 2mm. Dækkappen er ikke kompatibel til versioner uden dette fremspring (gammel version)."]
["Kartenleseeinsatz ist bündig. \nAchtung, nicht kompatibel mit neuem Cover (hervorstehender Kartenlesereinsatz).","Kartenleseeinsatz ist bündig. \nAchtung, nicht kompatibel mit neuem Cover (hervorstehender Kartenlesereinsatz).","The card reader insert is flush-mounted. \nPlease note that this version is not compatible with the new version (protruded card reader insert).","lecteur carte ancienne version - cette version n'est pas compatible avec la nouvelle (lecteur carte dépassant de 2 mm)","L'inserto per la lettura delle tessere e montato a filo. Nota bene: questa versione non è compatibile con la nuova versione ( inserto per la lettura sporgente )","Inbouw kaartlezer. Let op deze versie is niet compatibel met de nieuwe opbouw lezer versie","Bemærk: Kortlæseren har ikke et fremspring. Dækkappen er ikke kompatibel til versioner med fremspring (ny version)."]
[null,null,null,null,null,null,32]
[null,null,null,null,null,null,33]
[null,null,null,null,null,null,34]
[null,null,null,null,null,null,35]
[null,null,null,null,null,null,36]
[null,null,null,null,null,null,37]
[null,null,null,null,null,null,38]
[null,null,null,null,null,null,39]
[null,null,null,null,null,null,40]
[null,null,null,null,null,null,41]
[null,null,null,null,null,null,42]
[null,null,null,null,null,null,43]
[null,null,null,null,null,null,44]
[null,null,null,null,null,null,45]
[null,null,null,null,null,null,46]
[null,null,null,null,null,null,47]
[null,null,null,null,null,null,48]
[null,null,null,null,null,null,49]
[null,null,null,null,null,null,50]
[null,null,null,null,null,null,51]
[null,null,null,null,null,null,52]
[null,null,null,null,null,null,53]
[null,null,null,null,null,null,54]

{"sheet":"Zusammenfassung - summary","index":7,"n_rows":68,"n_cols":29,"rows_kept":68,"cut":false,"hidden":true,"merged":[[17,1,17,3],[16,0,16,3],[1,0,1,3],[6,0,6,1],[7,0,7,1],[9,0,9,1],[10,0,10,1],[12,0,12,1],[14,2,14,3]]}
[]
[{"$f":"HLOOKUP(G2,SI_Programming_Gateways!A158:F236,79,0)","v":"noch zu übersetzen"},null,null,null,null,null,{"$f":"'Hauptseite - main page'!G3:G3","v":"Dansk"}]
[null,null,null,null,null,null,{"$f":"SI_Programming_Gateways!J235","v":"noch zu übersetzen"}]
[]
[]
[]
[{"$f":"'Hauptseite - main page'!A8","v":"Kundenummer"},null,{"$f":"IF('Hauptseite - main page'!C8<>\"\",'Hauptseite - main page'!C8,\"\")","v":123456}]
[{"$f":"'Hauptseite - main page'!A9","v":"Kundenavn"},null,{"$f":"IF('Hauptseite - main page'!C9<>\"\",'Hauptseite - main page'!C9,\"\")","v":"Test customer"}]
[null,null,{"$f":"IF('Hauptseite - main page'!C10<>\"\",'Hauptseite - main page'!C10,\"\")","v":""}]
[{"$f":"'Hauptseite - main page'!A11","v":"Projektnummer"},null,{"$f":"IF('Hauptseite - main page'!C11<>\"\",'Hauptseite - main page'!C11,\"\")","v":"Test project"}]
[{"$f":"'Hauptseite - main page'!A12","v":"Projektnavn"},null,{"$f":"IF('Hauptseite - main page'!C12<>\"\",'Hauptseite - main page'!C12,\"\")","v":"19-Test"}]
[null,null,{"$f":"IF('Hauptseite - main page'!C13<>\"\",'Hauptseite - main page'!C13,\"\")","v":""}]
[{"$f":"'Hauptseite - main page'!A14","v":"Tillæg til ordrenummer"},null,{"$f":"IF('Hauptseite - main page'!C14<>\"\",'Hauptseite - main page'!C14,\"\")","v":987654321}]
[null,null,{"$f":"IF('Hauptseite - main page'!C15<>\"\",'Hauptseite - main page'!C15,\"\")","v":""}]
[{"$f":"'Hauptseite - main page'!I8","v":"noch zu übersetzen"},null,{"$f":"IF('Hauptseite - main page'!I9<>\"\",'Hauptseite - main page'!I9,\"\")","v":"to the office address"}]
[{"$f":"SI_Programming_Gateways!J217","v":"Yderligere information"}]
[]
[null,{"$f":"IF('Bestellhilfe - ordering guide'!A27=\"\",\"\",CHAR(10)&'Bestellhilfe - ordering guide'!A27&CHAR(10)&CHAR(10))&IF('Bestellhilfe - ordering guide'!A28=\"\",\"\",'Bestellhilfe - ordering guide'!A28&CHAR(10)&CHAR(10))&IF('Bestellhilfe - ordering guide'!A29=\"\",\"\",'Bestellhilfe - ordering guide'!A29)","v":""},null,null,null,null,null,null,null,null,null,null,null,null,null,null,null,null,null,null,null,null,null,null,null,null,null,null,{"$f":"B18","v":""}]
[{"$f":"SI_Programming_Gateways!A17","v":"Antal"},{"$f":"SI_Programming_Gateways!O17","v":"Komplet varenummer"},{"$f":"SI_Programming_Gateways!J240","v":0},{"$f":"SI_Programming_Gateways!J234","v":"noch zu übersetzen"}]
[{"$f":"IFERROR(INDEX('Hilfstabelle für Zus.fass.'!A:A,SMALL(IF('Hilfstabelle für Zus.fass.'!$B$1:$B$52<>\"\",ROW($1:$52)),ROW(A2))),\"\")","v":""},{"$f":"IFERROR(INDEX('Hilfstabelle für Zus.fass.'!B:B,SMALL(IF('Hilfstabelle für Zus.fass.'!$B$1:$B$52<>\"\",ROW($1:$52)),ROW(A2))),\"\")","v":""},{"$f":"IFERROR(IF(B20=\"\",\"\",VLOOKUP(B20,'OF-No.'!$A$2:$B$1350,2,FALSE)),SI_Programming_Gateways!$J$241)","v":""},{"$f":"IFERROR(INDEX('Hilfstabelle für Zus.fass.'!C:C,SMALL(IF('Hilfstabelle für Zus.fass.'!$B$1:$B$52<>\"\",ROW($1:$52)),ROW(A2))),\"\")","v":""}]
[{"$f":"IFERROR(INDEX('Hilfstabelle für Zus.fass.'!A:A,SMALL(IF('Hilfstabelle für Zus.fass.'!$B$1:$B$52<>\"\",ROW($1:$52)),ROW(A3))),\"\")","v":""},{"$f":"IFERROR(INDEX('Hilfstabelle für Zus.fass.'!B:B,SMALL(IF('Hilfstabelle für Zus.fass.'!$B$1:$B$52<>\"\",ROW($1:$52)),ROW(A3))),\"\")","v":""},{"$f":"IFERROR(IF(B21=\"\",\"\",VLOOKUP(B21,'OF-No.'!$A$2:$B$1350,2,FALSE)),SI_Programming_Gateways!$J$241)","v":""},{"$f":"IFERROR(INDEX('Hilfstabelle für Zus.fass.'!C:C,SMALL(IF('Hilfstabelle für Zus.fass.'!$B$1:$B$52<>\"\",ROW($1:$52)),ROW(A3))),\"\")","v":""}]
[{"$f":"IFERROR(INDEX('Hilfstabelle für Zus.fass.'!A:A,SMALL(IF('Hilfstabelle für Zus.fass.'!$B$1:$B$52<>\"\",ROW($1:$52)),ROW(A4))),\"\")","v":""},{"$f":"IFERROR(INDEX('Hilfstabelle für Zus.fass.'!B:B,SMALL(IF('Hilfstabelle für Zus.fass.'!$B$1:$B$52<>\"\",ROW($1:$52)),ROW(A4))),\"\")","v":""},{"$f":"IFERROR(IF(B22=\"\",\"\",VLOOKUP(B22,'OF-No.'!$A$2:$B$1350,2,FALSE)),SI_Programming_Gateways!$J$241)","v":""},{"$f":"IFERROR(INDEX('Hilfstabelle für Zus.fass.'!C:C,SMALL(IF('Hilfstabelle für Zus.fass.'!$B$1:$B$52<>\"\",ROW($1:$52)),ROW(A4))),\"\")","v":""}]
[{"$f":"IFERROR(INDEX('Hilfstabelle für Zus.fass.'!A:A,SMALL(IF('Hilfstabelle für Zus.fass.'!$B$1:$B$52<>\"\",ROW($1:$52)),ROW(A5))),\"\")","v":""},{"$f":"IFERROR(INDEX('Hilfstabelle für Zus.fass.'!B:B,SMALL(IF('Hilfstabelle für Zus.fass.'!$B$1:$B$52<>\"\",ROW($1:$52)),ROW(A5))),\"\")","v":""},{"$f":"IFERROR(IF(B23=\"\",\"\",VLOOKUP(B23,'OF-No.'!$A$2:$B$1350,2,FALSE)),SI_Programming_Gateways!$J$241)","v":""},{"$f":"IFERROR(INDEX('Hilfstabelle für Zus.fass.'!C:C,SMALL(IF('Hilfstabelle für Zus.fass.'!$B$1:$B$52<>\"\",ROW($1:$52)),ROW(A5))),\"\")","v":""}]
[{"$f":"IFERROR(INDEX('Hilfstabelle für Zus.fass.'!A:A,SMALL(IF('Hilfstabelle für Zus.fass.'!$B$1:$B$52<>\"\",ROW($1:$52)),ROW(A6))),\"\")","v":""},{"$f":"IFERROR(INDEX('Hilfstabelle für Zus.fass.'!B:B,SMALL(IF('Hilfstabelle für Zus.fass.'!$B$1:$B$52<>\"\",ROW($1:$52)),ROW(A6))),\"\")","v":""},{"$f":"IFERROR(IF(B24=\"\",\"\",VLOOKUP(B24,'OF-No.'!$A$2:$B$1350,2,FALSE)),SI_Programming_Gateways!$J$241)","v":""},{"$f":"IFERROR(INDEX('Hilfstabelle für Zus.fass.'!C:C,SMALL(IF('Hilfstabelle für Zus.fass.'!$B$1:$B$52<>\"\",ROW($1:$52)),ROW(A6))),\"\")","v":""}]
[{"$f":"IFERROR(INDEX('Hilfstabelle für Zus.fass.'!A:A,SMALL(IF('Hilfstabelle für Zus.fass.'!$B$1:$B$52<>\"\",ROW($1:$52)),ROW(A7))),\"\")","v":""},{"$f":"IFERROR(INDEX('Hilfstabelle für Zus.fass.'!B:B,SMALL(IF('Hilfstabelle für Zus.fass.'!$B$1:$B$52<>\"\",ROW($1:$52)),ROW(A7))),\"\")","v":""},{"$f":"IFERROR(IF(B25=\"\",\"\",VLOOKUP(B25,'OF-No.'!$A$2:$B$1350,2,FALSE)),SI_Programming_Gateways!$J$241)","v":""},{"$f":"IFERROR(INDEX('Hilfstabelle für Zus.fass.'!C:C,SMALL(IF('Hilfstabelle für Zus.fass.'!$B$1:$B$52<>\"\",ROW($1:$52)),ROW(A7))),\"\")","v":""}]
[{"$f":"IFERROR(INDEX('Hilfstabelle für Zus.fass.'!A:A,SMALL(IF('Hilfstabelle für Zus.fass.'!$B$1:$B$52<>\"\",ROW($1:$52)),ROW(A8))),\"\")","v":""},{"$f":"IFERROR(INDEX('Hilfstabelle für Zus.fass.'!B:B,SMALL(IF('Hilfstabelle für Zus.fass.'!$B$1:$B$52<>\"\",ROW($1:$52)),ROW(A8))),\"\")","v":""},{"$f":"IFERROR(IF(B26=\"\",\"\",VLOOKUP(B26,'OF-No.'!$A$2:$B$1350,2,FALSE)),SI_Programming_Gateways!$J$241)","v":""},{"$f":"IFERROR(INDEX('Hilfstabelle für Zus.fass.'!C:C,SMALL(IF('Hilfstabelle für Zus.fass.'!$B$1:$B$52<>\"\",ROW($1:$52)),ROW(A8))),\"\")","v":""}]
[{"$f":"IFERROR(INDEX('Hilfstabelle für Zus.fass.'!A:A,SMALL(IF('Hilfstabelle für Zus.fass.'!$B$1:$B$52<>\"\",ROW($1:$52)),ROW(A9))),\"\")","v":""},{"$f":"IFERROR(INDEX('Hilfstabelle für Zus.fass.'!B:B,SMALL(IF('Hilfstabelle für Zus.fass.'!$B$1:$B$52<>\"\",ROW($1:$52)),ROW(A9))),\"\")","v":""},{"$f":"IFERROR(IF(B27=\"\",\"\",VLOOKUP(B27,'OF-No.'!$A$2:$B$1350,2,FALSE)),SI_Programming_Gateways!$J$241)","v":""},{"$f":"IFERROR(INDEX('Hilfstabelle für Zus.fass.'!C:C,SMALL(IF('Hilfstabelle für Zus.fass.'!$B$1:$B$52<>\"\",ROW($1:$52)),ROW(A9))),\"\")","v":""}]
[{"$f":"IFERROR(INDEX('Hilfstabelle für Zus.fass.'!A:A,SMALL(IF('Hilfstabelle für Zus.fass.'!$B$1:$B$52<>\"\",ROW($1:$52)),ROW(A10))),\"\")","v":""},{"$f":"IFERROR(INDEX('Hilfstabelle für Zus.fass.'!B:B,SMALL(IF('Hilfstabelle für Zus.fass.'!$B$1:$B$52<>\"\",ROW($1:$52)),ROW(A10))),\"\")","v":""},{"$f":"IFERROR(IF(B28=\"\",\"\",VLOOKUP(B28,'OF-No.'!$A$2:$B$1350,2,FALSE)),SI_Programming_Gateways!$J$241)","v":""},{"$f":"IFERROR(INDEX('Hilfstabelle für Zus.fass.'!C:C,SMALL(IF('Hilfstabelle für Zus.fass.'!$B$1:$B$52<>\"\",ROW($1:$52)),ROW(A10))),\"\")","v":""}]
[{"$f":"IFERROR(INDEX('Hilfstabelle für Zus.fass.'!A:A,SMALL(IF('Hilfstabelle für Zus.fass.'!$B$1:$B$52<>\"\",ROW($1:$52)),ROW(A11))),\"\")","v":""},{"$f":"IFERROR(INDEX('Hilfstabelle für Zus.fass.'!B:B,SMALL(IF('Hilfstabelle für Zus.fass.'!$B$1:$B$52<>\"\",ROW($1:$52)),ROW(A11))),\"\")","v":""},{"$f":"IFERROR(IF(B29=\"\",\"\",VLOOKUP(B29,'OF-No.'!$A$2:$B$1350,2,FALSE)),SI_Programming_Gateways!$J$241)","v":""},{"$f":"IFERROR(INDEX('Hilfstabelle für Zus.fass.'!C:C,SMALL(IF('Hilfstabelle für Zus.fass.'!$B$1:$B$52<>\"\",ROW($1:$52)),ROW(A11))),\"\")","v":""}]
[{"$f":"IFERROR(INDEX('Hilfstabelle für Zus.fass.'!A:A,SMALL(IF('Hilfstabelle für Zus.fass.'!$B$1:$B$52<>\"\",ROW($1:$52)),ROW(A12))),\"\")","v":""},{"$f":"IFERROR(INDEX('Hilfstabelle für Zus.fass.'!B:B,SMALL(IF('Hilfstabelle für Zus.fass.'!$B$1:$B$52<>\"\",ROW($1:$52)),ROW(A12))),\"\")","v":""},{"$f":"IFERROR(IF(B30=\"\",\"\",VLOOKUP(B30,'OF-No.'!$A$2:$B$1350,2,FALSE)),SI_Programming_Gateways!$J$241)","v":""},{"$f":"IFERROR(INDEX('Hilfstabelle für Zus.fass.'!C:C,SMALL(IF('Hilfstabelle für Zus.fass.'!$B$1:$B$52<>\"\",ROW($1:$52)),ROW(A12))),\"\")","v":""}]
[{"$f":"IFERROR(INDEX('Hilfstabelle für Zus.fass.'!A:A,SMALL(IF('Hilfstabelle für Zus.fass.'!$B$1:$B$52<>\"\",ROW($1:$52)),ROW(A13))),\"\")","v":""},{"$f":"IFERROR(INDEX('Hilfstabelle für Zus.fass.'!B:B,SMALL(IF('Hilfstabelle für Zus.fass.'!$B$1:$B$52<>\"\",ROW($1:$52)),ROW(A13))),\"\")","v":""},{"$f":"IFERROR(IF(B31=\"\",\"\",VLOOKUP(B31,'OF-No.'!$A$2:$B$1350,2,FALSE)),SI_Programming_Gateways!$J$241)","v":""},{"$f":"IFERROR(INDEX('Hilfstabelle für Zus.fass.'!C:C,SMALL(IF('Hilfstabelle für Zus.fass.'!$B$1:$B$52<>\"\",ROW($1:$52)),ROW(A13))),\"\")","v":""}]
[{"$f":"IFERROR(INDEX('Hilfstabelle für Zus.fass.'!A:A,SMALL(IF('Hilfstabelle für Zus.fass.'!$B$1:$B$52<>\"\",ROW($1:$52)),ROW(A14))),\"\")","v":""},{"$f":"IFERROR(INDEX('Hilfstabelle für Zus.fass.'!B:B,SMALL(IF('Hilfstabelle für Zus.fass.'!$B$1:$B$52<>\"\",ROW($1:$52)),ROW(A14))),\"\")","v":""},{"$f":"IFERROR(IF(B32=\"\",\"\",VLOOKUP(B32,'OF-No.'!$A$2:$B$1350,2,FALSE)),SI_Programming_Gateways!$J$241)","v":""},{"$f":"IFERROR(INDEX('Hilfstabelle für Zus.fass.'!C:C,SMALL(IF('Hilfstabelle für Zus.fass.'!$B$1:$B$52<>\"\",ROW($1:$52)),ROW(A14))),\"\")","v":""}]
[{"$f":"IFERROR(INDEX('Hilfstabelle für Zus.fass.'!A:A,SMALL(IF('Hilfstabelle für Zus.fass.'!$B$1:$B$52<>\"\",ROW($1:$52)),ROW(A15))),\"\")","v":""},{"$f":"IFERROR(INDEX('Hilfstabelle für Zus.fass.'!B:B,SMALL(IF('Hilfstabelle für Zus.fass.'!$B$1:$B$52<>\"\",ROW($1:$52)),ROW(A15))),\"\")","v":""},{"$f":"IFERROR(IF(B33=\"\",\"\",VLOOKUP(B33,'OF-No.'!$A$2:$B$1350,2,FALSE)),SI_Programming_Gateways!$J$241)","v":""},{"$f":"IFERROR(INDEX('Hilfstabelle für Zus.fass.'!C:C,SMALL(IF('Hilfstabelle für Zus.fass.'!$B$1:$B$52<>\"\",ROW($1:$52)),ROW(A15))),\"\")","v":""}]
[{"$f":"IFERROR(INDEX('Hilfstabelle für Zus.fass.'!A:A,SMALL(IF('Hilfstabelle für Zus.fass.'!$B$1:$B$52<>\"\",ROW($1:$52)),ROW(A16))),\"\")","v":""},{"$f":"IFERROR(INDEX('Hilfstabelle für Zus.fass.'!B:B,SMALL(IF('Hilfstabelle für Zus.fass.'!$B$1:$B$52<>\"\",ROW($1:$52)),ROW(A16))),\"\")","v":""},{"$f":"IFERROR(IF(B34=\"\",\"\",VLOOKUP(B34,'OF-No.'!$A$2:$B$1350,2,FALSE)),SI_Programming_Gateways!$J$241)","v":""},{"$f":"IFERROR(INDEX('Hilfstabelle für Zus.fass.'!C:C,SMALL(IF('Hilfstabelle für Zus.fass.'!$B$1:$B$52<>\"\",ROW($1:$52)),ROW(A16))),\"\")","v":""}]
[{"$f":"IFERROR(INDEX('Hilfstabelle für Zus.fass.'!A:A,SMALL(IF('Hilfstabelle für Zus.fass.'!$B$1:$B$52<>\"\",ROW($1:$52)),ROW(A17))),\"\")","v":""},{"$f":"IFERROR(INDEX('Hilfstabelle für Zus.fass.'!B:B,SMALL(IF('Hilfstabelle für Zus.fass.'!$B$1:$B$52<>\"\",ROW($1:$52)),ROW(A17))),\"\")","v":""},{"$f":"IFERROR(IF(B35=\"\",\"\",VLOOKUP(B35,'OF-No.'!$A$2:$B$1350,2,FALSE)),SI_Programming_Gateways!$J$241)","v":""},{"$f":"IFERROR(INDEX('Hilfstabelle für Zus.fass.'!C:C,SMALL(IF('Hilfstabelle für Zus.fass.'!$B$1:$B$52<>\"\",ROW($1:$52)),ROW(A17))),\"\")","v":""}]
[{"$f":"IFERROR(INDEX('Hilfstabelle für Zus.fass.'!A:A,SMALL(IF('Hilfstabelle für Zus.fass.'!$B$1:$B$52<>\"\",ROW($1:$52)),ROW(A18))),\"\")","v":""},{"$f":"IFERROR(INDEX('Hilfstabelle für Zus.fass.'!B:B,SMALL(IF('Hilfstabelle für Zus.fass.'!$B$1:$B$52<>\"\",ROW($1:$52)),ROW(A18))),\"\")","v":""},{"$f":"IFERROR(IF(B36=\"\",\"\",VLOOKUP(B36,'OF-No.'!$A$2:$B$1350,2,FALSE)),SI_Programming_Gateways!$J$241)","v":""},{"$f":"IFERROR(INDEX('Hilfstabelle für Zus.fass.'!C:C,SMALL(IF('Hilfstabelle für Zus.fass.'!$B$1:$B$52<>\"\",ROW($1:$52)),ROW(A18))),\"\")","v":""}]
[{"$f":"IFERROR(INDEX('Hilfstabelle für Zus.fass.'!A:A,SMALL(IF('Hilfstabelle für Zus.fass.'!$B$1:$B$52<>\"\",ROW($1:$52)),ROW(A19))),\"\")","v":""},{"$f":"IFERROR(INDEX('Hilfstabelle für Zus.fass.'!B:B,SMALL(IF('Hilfstabelle für Zus.fass.'!$B$1:$B$52<>\"\",ROW($1:$52)),ROW(A19))),\"\")","v":""},{"$f":"IFERROR(IF(B37=\"\",\"\",VLOOKUP(B37,'OF-No.'!$A$2:$B$1350,2,FALSE)),SI_Programming_Gateways!$J$241)","v":""},{"$f":"IFERROR(INDEX('Hilfstabelle für Zus.fass.'!C:C,SMALL(IF('Hilfstabelle für Zus.fass.'!$B$1:$B$52<>\"\",ROW($1:$52)),ROW(A19))),\"\")","v":""}]
[{"$f":"IFERROR(INDEX('Hilfstabelle für Zus.fass.'!A:A,SMALL(IF('Hilfstabelle für Zus.fass.'!$B$1:$B$52<>\"\",ROW($1:$52)),ROW(A20))),\"\")","v":""},{"$f":"IFERROR(INDEX('Hilfstabelle für Zus.fass.'!B:B,SMALL(IF('Hilfstabelle für Zus.fass.'!$B$1:$B$52<>\"\",ROW($1:$52)),ROW(A20))),\"\")","v":""},{"$f":"IFERROR(IF(B38=\"\",\"\",VLOOKUP(B38,'OF-No.'!$A$2:$B$1350,2,FALSE)),SI_Programming_Gateways!$J$241)","v":""},{"$f":"IFERROR(INDEX('Hilfstabelle für Zus.fass.'!C:C,SMALL(IF('Hilfstabelle für Zus.fass.'!$B$1:$B$52<>\"\",ROW($1:$52)),ROW(A20))),\"\")","v":""}]
[{"$f":"IFERROR(INDEX('Hilfstabelle für Zus.fass.'!A:A,SMALL(IF('Hilfstabelle für Zus.fass.'!$B$1:$B$52<>\"\",ROW($1:$52)),ROW(A21))),\"\")","v":""},{"$f":"IFERROR(INDEX('Hilfstabelle für Zus.fass.'!B:B,SMALL(IF('Hilfstabelle für Zus.fass.'!$B$1:$B$52<>\"\",ROW($1:$52)),ROW(A21))),\"\")","v":""},{"$f":"IFERROR(IF(B39=\"\",\"\",VLOOKUP(B39,'OF-No.'!$A$2:$B$1350,2,FALSE)),SI_Programming_Gateways!$J$241)","v":""},{"$f":"IFERROR(INDEX('Hilfstabelle für Zus.fass.'!C:C,SMALL(IF('Hilfstabelle für Zus.fass.'!$B$1:$B$52<>\"\",ROW($1:$52)),ROW(A21))),\"\")","v":""}]
[{"$f":"IFERROR(INDEX('Hilfstabelle für Zus.fass.'!A:A,SMALL(IF('Hilfstabelle für Zus.fass.'!$B$1:$B$52<>\"\",ROW($1:$52)),ROW(A22))),\"\")","v":""},{"$f":"IFERROR(INDEX('Hilfstabelle für Zus.fass.'!B:B,SMALL(IF('Hilfstabelle für Zus.fass.'!$B$1:$B$52<>\"\",ROW($1:$52)),ROW(A22))),\"\")","v":""},{"$f":"IFERROR(IF(B40=\"\",\"\",VLOOKUP(B40,'OF-No.'!$A$2:$B$1350,2,FALSE)),SI_Programming_Gateways!$J$241)","v":""},{"$f":"IFERROR(INDEX('Hilfstabelle für Zus.fass.'!C:C,SMALL(IF('Hilfstabelle für Zus.fass.'!$B$1:$B$52<>\"\",ROW($1:$52)),ROW(A22))),\"\")","v":""}]
[{"$f":"IFERROR(INDEX('Hilfstabelle für Zus.fass.'!A:A,SMALL(IF('Hilfstabelle für Zus.fass.'!$B$1:$B$52<>\"\",ROW($1:$52)),ROW(A23))),\"\")","v":""},{"$f":"IFERROR(INDEX('Hilfstabelle für Zus.fass.'!B:B,SMALL(IF('Hilfstabelle für Zus.fass.'!$B$1:$B$52<>\"\",ROW($1:$52)),ROW(A23))),\"\")","v":""},{"$f":"IFERROR(IF(B41=\"\",\"\",VLOOKUP(B41,'OF-No.'!$A$2:$B$1350,2,FALSE)),SI_Programming_Gateways!$J$241)","v":""},{"$f":"IFERROR(INDEX('Hilfstabelle für Zus.fass.'!C:C,SMALL(IF('Hilfstabelle für Zus.fass.'!$B$1:$B$52<>\"\",ROW($1:$52)),ROW(A23))),\"\")","v":""}]
[{"$f":"IFERROR(INDEX('Hilfstabelle für Zus.fass.'!A:A,SMALL(IF('Hilfstabelle für Zus.fass.'!$B$1:$B$52<>\"\",ROW($1:$52)),ROW(A24))),\"\")","v":""},{"$f":"IFERROR(INDEX('Hilfstabelle für Zus.fass.'!B:B,SMALL(IF('Hilfstabelle für Zus.fass.'!$B$1:$B$52<>\"\",ROW($1:$52)),ROW(A24))),\"\")","v":""},{"$f":"IFERROR(IF(B42=\"\",\"\",VLOOKUP(B42,'OF-No.'!$A$2:$B$1350,2,FALSE)),SI_Programming_Gateways!$J$241)","v":""},{"$f":"IFERROR(INDEX('Hilfstabelle für Zus.fass.'!C:C,SMALL(IF('Hilfstabelle für Zus.fass.'!$B$1:$B$52<>\"\",ROW($1:$52)),ROW(A24))),\"\")","v":""}]
[{"$f":"IFERROR(INDEX('Hilfstabelle für Zus.fass.'!A:A,SMALL(IF('Hilfstabelle für Zus.fass.'!$B$1:$B$52<>\"\",ROW($1:$52)),ROW(A25))),\"\")","v":""},{"$f":"IFERROR(INDEX('Hilfstabelle für Zus.fass.'!B:B,SMALL(IF('Hilfstabelle für Zus.fass.'!$B$1:$B$52<>\"\",ROW($1:$52)),ROW(A25))),\"\")","v":""},{"$f":"IFERROR(IF(B43=\"\",\"\",VLOOKUP(B43,'OF-No.'!$A$2:$B$1350,2,FALSE)),SI_Programming_Gateways!$J$241)","v":""},{"$f":"IFERROR(INDEX('Hilfstabelle für Zus.fass.'!C:C,SMALL(IF('Hilfstabelle für Zus.fass.'!$B$1:$B$52<>\"\",ROW($1:$52)),ROW(A25))),\"\")","v":""}]
[{"$f":"IFERROR(INDEX('Hilfstabelle für Zus.fass.'!A:A,SMALL(IF('Hilfstabelle für Zus.fass.'!$B$1:$B$52<>\"\",ROW($1:$52)),ROW(A26))),\"\")","v":""},{"$f":"IFERROR(INDEX('Hilfstabelle für Zus.fass.'!B:B,SMALL(IF('Hilfstabelle für Zus.fass.'!$B$1:$B$52<>\"\",ROW($1:$52)),ROW(A26))),\"\")","v":""},{"$f":"IFERROR(IF(B44=\"\",\"\",VLOOKUP(B44,'OF-No.'!$A$2:$B$1350,2,FALSE)),SI_Programming_Gateways!$J$241)","v":""},{"$f":"IFERROR(INDEX('Hilfstabelle für Zus.fass.'!C:C,SMALL(IF('Hilfstabelle für Zus.fass.'!$B$1:$B$52<>\"\",ROW($1:$52)),ROW(A26))),\"\")","v":""}]
[{"$f":"IFERROR(INDEX('Hilfstabelle für Zus.fass.'!A:A,SMALL(IF('Hilfstabelle für Zus.fass.'!$B$1:$B$52<>\"\",ROW($1:$52)),ROW(A27))),\"\")","v":""},{"$f":"IFERROR(INDEX('Hilfstabelle für Zus.fass.'!B:B,SMALL(IF('Hilfstabelle für Zus.fass.'!$B$1:$B$52<>\"\",ROW($1:$52)),ROW(A27))),\"\")","v":""},{"$f":"IFERROR(IF(B45=\"\",\"\",VLOOKUP(B45,'OF-No.'!$A$2:$B$1350,2,FALSE)),SI_Programming_Gateways!$J$241)","v":""},{"$f":"IFERROR(INDEX('Hilfstabelle für Zus.fass.'!C:C,SMALL(IF('Hilfstabelle für Zus.fass.'!$B$1:$B$52<>\"\",ROW($1:$52)),ROW(A27))),\"\")","v":""}]
[{"$f":"IFERROR(INDEX('Hilfstabelle für Zus.fass.'!A:A,SMALL(IF('Hilfstabelle für Zus.fass.'!$B$1:$B$52<>\"\",ROW($1:$52)),ROW(A28))),\"\")","v":""},{"$f":"IFERROR(INDEX('Hilfstabelle für Zus.fass.'!B:B,SMALL(IF('Hilfstabelle für Zus.fass.'!$B$1:$B$52<>\"\",ROW($1:$52)),ROW(A28))),\"\")","v":""},{"$f":"IFERROR(IF(B46=\"\",\"\",VLOOKUP(B46,'OF-No.'!$A$2:$B$1350,2,FALSE)),SI_Programming_Gateways!$J$241)","v":""},{"$f":"IFERROR(INDEX('Hilfstabelle für Zus.fass.'!C:C,SMALL(IF('Hilfstabelle für Zus.fass.'!$B$1:$B$52<>\"\",ROW($1:$52)),ROW(A28))),\"\")","v":""}]
[{"$f":"IFERROR(INDEX('Hilfstabelle für Zus.fass.'!A:A,SMALL(IF('Hilfstabelle für Zus.fass.'!$B$1:$B$52<>\"\",ROW($1:$52)),ROW(A29))),\"\")","v":""},{"$f":"IFERROR(INDEX('Hilfstabelle für Zus.fass.'!B:B,SMALL(IF('Hilfstabelle für Zus.fass.'!$B$1:$B$52<>\"\",ROW($1:$52)),ROW(A29))),\"\")","v":""},{"$f":"IFERROR(IF(B47=\"\",\"\",VLOOKUP(B47,'OF-No.'!$A$2:$B$1350,2,FALSE)),SI_Programming_Gateways!$J$241)","v":""},{"$f":"IFERROR(INDEX('Hilfstabelle für Zus.fass.'!C:C,SMALL(IF('Hilfstabelle für Zus.fass.'!$B$1:$B$52<>\"\",ROW($1:$52)),ROW(A29))),\"\")","v":""}]
[{"$f":"IFERROR(INDEX('Hilfstabelle für Zus.fass.'!A:A,SMALL(IF('Hilfstabelle für Zus.fass.'!$B$1:$B$52<>\"\",ROW($1:$52)),ROW(A30))),\"\")","v":""},{"$f":"IFERROR(INDEX('Hilfstabelle für Zus.fass.'!B:B,SMALL(IF('Hilfstabelle für Zus.fass.'!$B$1:$B$52<>\"\",ROW($1:$52)),ROW(A30))),\"\")","v":""},{"$f":"IFERROR(IF(B48=\"\",\"\",VLOOKUP(B48,'OF-No.'!$A$2:$B$1350,2,FALSE)),SI_Programming_Gateways!$J$241)","v":""},{"$f":"IFERROR(INDEX('Hilfstabelle für Zus.fass.'!C:C,SMALL(IF('Hilfstabelle für Zus.fass.'!$B$1:$B$52<>\"\",ROW($1:$52)),ROW(A30))),\"\")","v":""}]
[{"$f":"IFERROR(INDEX('Hilfstabelle für Zus.fass.'!A:A,SMALL(IF('Hilfstabelle für Zus.fass.'!$B$1:$B$52<>\"\",ROW($1:$52)),ROW(A31))),\"\")","v":""},{"$f":"IFERROR(INDEX('Hilfstabelle für Zus.fass.'!B:B,SMALL(IF('Hilfstabelle für Zus.fass.'!$B$1:$B$52<>\"\",ROW($1:$52)),ROW(A31))),\"\")","v":""},{"$f":"IFERROR(IF(B49=\"\",\"\",VLOOKUP(B49,'OF-No.'!$A$2:$B$1350,2,FALSE)),SI_Programming_Gateways!$J$241)","v":""},{"$f":"IFERROR(INDEX('Hilfstabelle für Zus.fass.'!C:C,SMALL(IF('Hilfstabelle für Zus.fass.'!$B$1:$B$52<>\"\",ROW($1:$52)),ROW(A31))),\"\")","v":""}]
[{"$f":"IFERROR(INDEX('Hilfstabelle für Zus.fass.'!A:A,SMALL(IF('Hilfstabelle für Zus.fass.'!$B$1:$B$52<>\"\",ROW($1:$52)),ROW(A32))),\"\")","v":""},{"$f":"IFERROR(INDEX('Hilfstabelle für Zus.fass.'!B:B,SMALL(IF('Hilfstabelle für Zus.fass.'!$B$1:$B$52<>\"\",ROW($1:$52)),ROW(A32))),\"\")","v":""},{"$f":"IFERROR(IF(B50=\"\",\"\",VLOOKUP(B50,'OF-No.'!$A$2:$B$1350,2,FALSE)),SI_Programming_Gateways!$J$241)","v":""},{"$f":"IFERROR(INDEX('Hilfstabelle für Zus.fass.'!C:C,SMALL(IF('Hilfstabelle für Zus.fass.'!$B$1:$B$52<>\"\",ROW($1:$52)),ROW(A32))),\"\")","v":""}]
[{"$f":"IFERROR(INDEX('Hilfstabelle für Zus.fass.'!A:A,SMALL(IF('Hilfstabelle für Zus.fass.'!$B$1:$B$52<>\"\",ROW($1:$52)),ROW(A33))),\"\")","v":""},{"$f":"IFERROR(INDEX('Hilfstabelle für Zus.fass.'!B:B,SMALL(IF('Hilfstabelle für Zus.fass.'!$B$1:$B$52<>\"\",ROW($1:$52)),ROW(A33))),\"\")","v":""},{"$f":"IFERROR(IF(B51=\"\",\"\",VLOOKUP(B51,'OF-No.'!$A$2:$B$1350,2,FALSE)),SI_Programming_Gateways!$J$241)","v":""},{"$f":"IFERROR(INDEX('Hilfstabelle für Zus.fass.'!C:C,SMALL(IF('Hilfstabelle für Zus.fass.'!$B$1:$B$52<>\"\",ROW($1:$52)),ROW(A33))),\"\")","v":""}]
[{"$f":"IFERROR(INDEX('Hilfstabelle für Zus.fass.'!A:A,SMALL(IF('Hilfstabelle für Zus.fass.'!$B$1:$B$52<>\"\",ROW($1:$52)),ROW(A34))),\"\")","v":""},{"$f":"IFERROR(INDEX('Hilfstabelle für Zus.fass.'!B:B,SMALL(IF('Hilfstabelle für Zus.fass.'!$B$1:$B$52<>\"\",ROW($1:$52)),ROW(A34))),\"\")","v":""},{"$f":"IFERROR(IF(B52=\"\",\"\",VLOOKUP(B52,'OF-No.'!$A$2:$B$1350,2,FALSE)),SI_Programming_Gateways!$J$241)","v":""},{"$f":"IFERROR(INDEX('Hilfstabelle für Zus.fass.'!C:C,SMALL(IF('Hilfstabelle für Zus.fass.'!$B$1:$B$52<>\"\",ROW($1:$52)),ROW(A34))),\"\")","v":""}]
[{"$f":"IFERROR(INDEX('Hilfstabelle für Zus.fass.'!A:A,SMALL(IF('Hilfstabelle für Zus.fass.'!$B$1:$B$52<>\"\",ROW($1:$52)),ROW(A35))),\"\")","v":""},{"$f":"IFERROR(INDEX('Hilfstabelle für Zus.fass.'!B:B,SMALL(IF('Hilfstabelle für Zus.fass.'!$B$1:$B$52<>\"\",ROW($1:$52)),ROW(A35))),\"\")","v":""},{"$f":"IFERROR(IF(B53=\"\",\"\",VLOOKUP(B53,'OF-No.'!$A$2:$B$1350,2,FALSE)),SI_Programming_Gateways!$J$241)","v":""},{"$f":"IFERROR(INDEX('Hilfstabelle für Zus.fass.'!C:C,SMALL(IF('Hilfstabelle für Zus.fass.'!$B$1:$B$52<>\"\",ROW($1:$52)),ROW(A35))),\"\")","v":""}]
[{"$f":"IFERROR(INDEX('Hilfstabelle für Zus.fass.'!A:A,SMALL(IF('Hilfstabelle für Zus.fass.'!$B$1:$B$52<>\"\",ROW($1:$52)),ROW(A36))),\"\")","v":""},{"$f":"IFERROR(INDEX('Hilfstabelle für Zus.fass.'!B:B,SMALL(IF('Hilfstabelle für Zus.fass.'!$B$1:$B$52<>\"\",ROW($1:$52)),ROW(A36))),\"\")","v":""},{"$f":"IFERROR(IF(B54=\"\",\"\",VLOOKUP(B54,'OF-No.'!$A$2:$B$1350,2,FALSE)),SI_Programming_Gateways!$J$241)","v":""},{"$f":"IFERROR(INDEX('Hilfstabelle für Zus.fass.'!C:C,SMALL(IF('Hilfstabelle für Zus.fass.'!$B$1:$B$52<>\"\",ROW($1:$52)),ROW(A36))),\"\")","v":""}]
[{"$f":"IFERROR(INDEX('Hilfstabelle für Zus.fass.'!A:A,SMALL(IF('Hilfstabelle für Zus.fass.'!$B$1:$B$52<>\"\",ROW($1:$52)),ROW(A37))),\"\")","v":""},{"$f":"IFERROR(INDEX('Hilfstabelle für Zus.fass.'!B:B,SMALL(IF('Hilfstabelle für Zus.fass.'!$B$1:$B$52<>\"\",ROW($1:$52)),ROW(A37))),\"\")","v":""},{"$f":"IFERROR(IF(B55=\"\",\"\",VLOOKUP(B55,'OF-No.'!$A$2:$B$1350,2,FALSE)),SI_Programming_Gateways!$J$241)","v":""},{"$f":"IFERROR(INDEX('Hilfstabelle für Zus.fass.'!C:C,SMALL(IF('Hilfstabelle für Zus.fass.'!$B$1:$B$52<>\"\",ROW($1:$52)),ROW(A37))),\"\")","v":""}]
[{"$f":"IFERROR(INDEX('Hilfstabelle für Zus.fass.'!A:A,SMALL(IF('Hilfstabelle für Zus.fass.'!$B$1:$B$52<>\"\",ROW($1:$52)),ROW(A38))),\"\")","v":""},{"$f":"IFERROR(INDEX('Hilfstabelle für Zus.fass.'!B:B,SMALL(IF('Hilfstabelle für Zus.fass.'!$B$1:$B$52<>\"\",ROW($1:$52)),ROW(A38))),\"\")","v":""},{"$f":"IFERROR(IF(B56=\"\",\"\",VLOOKUP(B56,'OF-No.'!$A$2:$B$1350,2,FALSE)),SI_Programming_Gateways!$J$241)","v":""},{"$f":"IFERROR(INDEX('Hilfstabelle für Zus.fass.'!C:C,SMALL(IF('Hilfstabelle für Zus.fass.'!$B$1:$B$52<>\"\",ROW($1:$52)),ROW(A38))),\"\")","v":""}]
[{"$f":"IFERROR(INDEX('Hilfstabelle für Zus.fass.'!A:A,SMALL(IF('Hilfstabelle für Zus.fass.'!$B$1:$B$52<>\"\",ROW($1:$52)),ROW(A39))),\"\")","v":""},{"$f":"IFERROR(INDEX('Hilfstabelle für Zus.fass.'!B:B,SMALL(IF('Hilfstabelle für Zus.fass.'!$B$1:$B$52<>\"\",ROW($1:$52)),ROW(A39))),\"\")","v":""},{"$f":"IFERROR(IF(B57=\"\",\"\",VLOOKUP(B57,'OF-No.'!$A$2:$B$1350,2,FALSE)),SI_Programming_Gateways!$J$241)","v":""},{"$f":"IFERROR(INDEX('Hilfstabelle für Zus.fass.'!C:C,SMALL(IF('Hilfstabelle für Zus.fass.'!$B$1:$B$52<>\"\",ROW($1:$52)),ROW(A39))),\"\")","v":""}]
[{"$f":"IFERROR(INDEX('Hilfstabelle für Zus.fass.'!A:A,SMALL(IF('Hilfstabelle für Zus.fass.'!$B$1:$B$50<>\"\",ROW($1:$50)),ROW(A40))),\"\")","v":""},{"$f":"IFERROR(INDEX('Hilfstabelle für Zus.fass.'!B:B,SMALL(IF('Hilfstabelle für Zus.fass.'!$B$1:$B$50<>\"\",ROW($1:$50)),ROW(A40))),\"\")","v":""},{"$f":"IFERROR(IF(B58=\"\",\"\",VLOOKUP(B58,'OF-No.'!$A$2:$B$1350,2,FALSE)),SI_Programming_Gateways!$J$241)","v":""},{"$f":"IFERROR(INDEX('Hilfstabelle für Zus.fass.'!C:C,SMALL(IF('Hilfstabelle für Zus.fass.'!$B$1:$B$52<>\"\",ROW($1:$52)),ROW(A40))),\"\")","v":""}]
[{"$f":"IFERROR(INDEX('Hilfstabelle für Zus.fass.'!A:A,SMALL(IF('Hilfstabelle für Zus.fass.'!$B$1:$B$50<>\"\",ROW($1:$50)),ROW(A41))),\"\")","v":""},{"$f":"IFERROR(INDEX('Hilfstabelle für Zus.fass.'!B:B,SMALL(IF('Hilfstabelle für Zus.fass.'!$B$1:$B$50<>\"\",ROW($1:$50)),ROW(A41))),\"\")","v":""},{"$f":"IFERROR(IF(B59=\"\",\"\",VLOOKUP(B59,'OF-No.'!$A$2:$B$1350,2,FALSE)),SI_Programming_Gateways!$J$241)","v":""},{"$f":"IFERROR(INDEX('Hilfstabelle für Zus.fass.'!C:C,SMALL(IF('Hilfstabelle für Zus.fass.'!$B$1:$B$52<>\"\",ROW($1:$52)),ROW(A41))),\"\")","v":""}]
[{"$f":"IFERROR(INDEX('Hilfstabelle für Zus.fass.'!A:A,SMALL(IF('Hilfstabelle für Zus.fass.'!$B$1:$B$50<>\"\",ROW($1:$50)),ROW(A42))),\"\")","v":""},{"$f":"IFERROR(INDEX('Hilfstabelle für Zus.fass.'!B:B,SMALL(IF('Hilfstabelle für Zus.fass.'!$B$1:$B$50<>\"\",ROW($1:$50)),ROW(A42))),\"\")","v":""},{"$f":"IFERROR(IF(B60=\"\",\"\",VLOOKUP(B60,'OF-No.'!$A$2:$B$1350,2,FALSE)),SI_Programming_Gateways!$J$241)","v":""},{"$f":"IFERROR(INDEX('Hilfstabelle für Zus.fass.'!C:C,SMALL(IF('Hilfstabelle für Zus.fass.'!$B$1:$B$52<>\"\",ROW($1:$52)),ROW(A42))),\"\")","v":""}]
[{"$f":"IFERROR(INDEX('Hilfstabelle für Zus.fass.'!A:A,SMALL(IF('Hilfstabelle für Zus.fass.'!$B$1:$B$50<>\"\",ROW($1:$50)),ROW(A43))),\"\")","v":""},{"$f":"IFERROR(INDEX('Hilfstabelle für Zus.fass.'!B:B,SMALL(IF('Hilfstabelle für Zus.fass.'!$B$1:$B$50<>\"\",ROW($1:$50)),ROW(A43))),\"\")","v":""},{"$f":"IFERROR(IF(B61=\"\",\"\",VLOOKUP(B61,'OF-No.'!$A$2:$B$1350,2,FALSE)),SI_Programming_Gateways!$J$241)","v":""},{"$f":"IFERROR(INDEX('Hilfstabelle für Zus.fass.'!C:C,SMALL(IF('Hilfstabelle für Zus.fass.'!$B$1:$B$52<>\"\",ROW($1:$52)),ROW(A43))),\"\")","v":""}]
[{"$f":"IFERROR(INDEX('Hilfstabelle für Zus.fass.'!A:A,SMALL(IF('Hilfstabelle für Zus.fass.'!$B$1:$B$50<>\"\",ROW($1:$50)),ROW(A44))),\"\")","v":""},{"$f":"IFERROR(INDEX('Hilfstabelle für Zus.fass.'!B:B,SMALL(IF('Hilfstabelle für Zus.fass.'!$B$1:$B$50<>\"\",ROW($1:$50)),ROW(A44))),\"\")","v":""},{"$f":"IFERROR(IF(B62=\"\",\"\",VLOOKUP(B62,'OF-No.'!$A$2:$B$1350,2,FALSE)),SI_Programming_Gateways!$J$241)","v":""},{"$f":"IFERROR(INDEX('Hilfstabelle für Zus.fass.'!C:C,SMALL(IF('Hilfstabelle für Zus.fass.'!$B$1:$B$52<>\"\",ROW($1:$52)),ROW(A44))),\"\")","v":""}]
[{"$f":"IFERROR(INDEX('Hilfstabelle für Zus.fass.'!A:A,SMALL(IF('Hilfstabelle für Zus.fass.'!$B$1:$B$50<>\"\",ROW($1:$50)),ROW(A45))),\"\")","v":""},{"$f":"IFERROR(INDEX('Hilfstabelle für Zus.fass.'!B:B,SMALL(IF('Hilfstabelle für Zus.fass.'!$B$1:$B$50<>\"\",ROW($1:$50)),ROW(A45))),\"\")","v":""},{"$f":"IFERROR(IF(B63=\"\",\"\",VLOOKUP(B63,'OF-No.'!$A$2:$B$1350,2,FALSE)),SI_Programming_Gateways!$J$241)","v":""},{"$f":"IFERROR(INDEX('Hilfstabelle für Zus.fass.'!C:C,SMALL(IF('Hilfstabelle für Zus.fass.'!$B$1:$B$52<>\"\",ROW($1:$52)),ROW(A45))),\"\")","v":""}]
[{"$f":"IFERROR(INDEX('Hilfstabelle für Zus.fass.'!A:A,SMALL(IF('Hilfstabelle für Zus.fass.'!$B$1:$B$50<>\"\",ROW($1:$50)),ROW(A46))),\"\")","v":""},{"$f":"IFERROR(INDEX('Hilfstabelle für Zus.fass.'!B:B,SMALL(IF('Hilfstabelle für Zus.fass.'!$B$1:$B$50<>\"\",ROW($1:$50)),ROW(A46))),\"\")","v":""},{"$f":"IFERROR(IF(B64=\"\",\"\",VLOOKUP(B64,'OF-No.'!$A$2:$B$1350,2,FALSE)),SI_Programming_Gateways!$J$241)","v":""},{"$f":"IFERROR(INDEX('Hilfstabelle für Zus.fass.'!C:C,SMALL(IF('Hilfstabelle für Zus.fass.'!$B$1:$B$52<>\"\",ROW($1:$52)),ROW(A46))),\"\")","v":""}]
[{"$f":"IFERROR(INDEX('Hilfstabelle für Zus.fass.'!A:A,SMALL(IF('Hilfstabelle für Zus.fass.'!$B$1:$B$50<>\"\",ROW($1:$50)),ROW(A47))),\"\")","v":""},{"$f":"IFERROR(INDEX('Hilfstabelle für Zus.fass.'!B:B,SMALL(IF('Hilfstabelle für Zus.fass.'!$B$1:$B$50<>\"\",ROW($1:$50)),ROW(A47))),\"\")","v":""},{"$f":"IFERROR(IF(B65=\"\",\"\",VLOOKUP(B65,'OF-No.'!$A$2:$B$1350,2,FALSE)),SI_Programming_Gateways!$J$241)","v":""},{"$f":"IFERROR(INDEX('Hilfstabelle für Zus.fass.'!C:C,SMALL(IF('Hilfstabelle für Zus.fass.'!$B$1:$B$52<>\"\",ROW($1:$52)),ROW(A47))),\"\")","v":""}]
[{"$f":"IFERROR(INDEX('Hilfstabelle für Zus.fass.'!A:A,SMALL(IF('Hilfstabelle für Zus.fass.'!$B$1:$B$50<>\"\",ROW($1:$50)),ROW(A48))),\"\")","v":""},{"$f":"IFERROR(INDEX('Hilfstabelle für Zus.fass.'!B:B,SMALL(IF('Hilfstabelle für Zus.fass.'!$B$1:$B$50<>\"\",ROW($1:$50)),ROW(A48))),\"\")","v":""},{"$f":"IFERROR(IF(B66=\"\",\"\",VLOOKUP(B66,'OF-No.'!$A$2:$B$1350,2,FALSE)),SI_Programming_Gateways!$J$241)","v":""},{"$f":"IFERROR(INDEX('Hilfstabelle für Zus.fass.'!C:C,SMALL(IF('Hilfstabelle für Zus.fass.'!$B$1:$B$52<>\"\",ROW($1:$52)),ROW(A48))),\"\")","v":""}]
[{"$f":"IFERROR(INDEX('Hilfstabelle für Zus.fass.'!A:A,SMALL(IF('Hilfstabelle für Zus.fass.'!$B$1:$B$50<>\"\",ROW($1:$50)),ROW(A49))),\"\")","v":""},{"$f":"IFERROR(INDEX('Hilfstabelle für Zus.fass.'!B:B,SMALL(IF('Hilfstabelle für Zus.fass.'!$B$1:$B$50<>\"\",ROW($1:$50)),ROW(A49))),\"\")","v":""},{"$f":"IFERROR(IF(B67=\"\",\"\",VLOOKUP(B67,'OF-No.'!$A$2:$B$1350,2,FALSE)),SI_Programming_Gateways!$J$241)","v":""},{"$f":"IFERROR(INDEX('Hilfstabelle für Zus.fass.'!C:C,SMALL(IF('Hilfstabelle für Zus.fass.'!$B$1:$B$52<>\"\",ROW($1:$52)),ROW(A49))),\"\")","v":""}]
[{"$f":"IFERROR(INDEX('Hilfstabelle für Zus.fass.'!A:A,SMALL(IF('Hilfstabelle für Zus.fass.'!$B$1:$B$50<>\"\",ROW($1:$50)),ROW(A50))),\"\")","v":""},{"$f":"IFERROR(INDEX('Hilfstabelle für Zus.fass.'!B:B,SMALL(IF('Hilfstabelle für Zus.fass.'!$B$1:$B$50<>\"\",ROW($1:$50)),ROW(A50))),\"\")","v":""},{"$f":"IFERROR(IF(B68=\"\",\"\",VLOOKUP(B68,'OF-No.'!$A$2:$B$1350,2,FALSE)),SI_Programming_Gateways!$J$241)","v":""},{"$f":"IFERROR(INDEX('Hilfstabelle für Zus.fass.'!C:C,SMALL(IF('Hilfstabelle für Zus.fass.'!$B$1:$B$50<>\"\",ROW($1:$50)),ROW(A50))),\"\")","v":""}]

{"sheet":"Comments","index":8,"n_rows":25,"n_cols":7,"rows_kept":25,"cut":false,"hidden":true,"merged":[]}
["Sprache","Deutsch","English","Francais","Italiano","Nederlands","Dansk"]
["Wireless online / Virtual CardNetwork","Wireless Online\nVirtual CardNetwork","Wireless Online\nVirtual CardNetwork","Wireless Online\nVirtual CardNetwork","Wireless Online\nVirtual CardNetwork","Wireless Online\nVirtual CardNetwork","Wireless Online\nVirtual CardNetwork"]
["SmartHandle Typ","Standard SmartHandle (ohne Door Monitoring)\nDoor Monitoring (SV Sensorik)\nDoor Monitoring  (Schlosssensorik)\nDoor Monitoring (Drückersensorik)","Standard SmartHandle (without Door Monitoring)\nDoor Monitoring (SV sensors)\nDoor Monitoring (sensor locks)\nDoor Monitoring (handle sensor)","SmartHandle standard (sans Door Monitoring)\nDoor Monitoring (capteurs SV)\nDoor Monitoring (capteurs externes)\nDoor monitoring (capteur poignée)","SmartHandle standard (Senza DoorMonitoring)\nDoor Monitoring (sensore SV)\nDoor Monitoring (sensore esterno)\nDoor Monitoring (sensore sulla leva)","Standaard SmartHandle (zonder deurstand signalering)\nDeurstand signalering (SV sensors)\nDeurstand signalering (externe sensors)\nDeurstand signalering (kruk sensor)","Standard SmartHandle (uden dør monitorering)\nDør monitorering (SV sensorer)\nDør monitorering  (eksterne sensorer)\nDør monitorering (dørgrebs sensor)"]
["Profilname","Europrofil ohne MO\nSwiss Round ohne MO\nScandinavian Oval ohne MO\nEuroprofil mit MO\nSwiss Round mit MO\nScandinavian Oval mit MO\nEuroprofil mit MO (Plattensystem)","Europrofile without Mechanical Override (MO)\nSwiss Round without Mechanical Override (MO)\nScandinavian Oval without Mechanical Override (MO)\nEuroprofil with Mechanical Override (MO)\nSwiss Round with Mechanical Override (MO)\nScandinavian Oval with Mechanical Override (MO)\nEuro profile with Mechanical Override (MO) - plate system","Profil européen sans verrouillage mécanique\nProfil suisse sans verrouillage mécanique\nOvale scandinave sans verrouillage mécanique\nprofil européen avec Verrouillage mécanique (VM),     \nprofil suisse avec Verrouillage mécanique (VM)\nOvale scandinave avec Verrouillage mécanique (VM)","profilo europeo senza Mechanical Override (MO)\ntondo svizzero senza Mechanical Override (MO)\nBritish Oval senza Mechanical Override (MO)\nScandinavian Oval senza Mechanical Override (MO)\nprofilo europeo con mechanical override (MO)\ntondo svizzero con mechanical override (MO)\nScandinavian Oval con Mechanical Override (MO)","Wireless online\n Virtual CardNetwork","Europrofil uden udstandsning til låsecylinder\nSchweizisk Rund uden udstandsning til låsecylinder\nSkandinavisk Oval uden udstandsning til låsecylinder\nSchweizisk Rund med udstandsning til låsecylinder\nEuroprofil med udstandsning til låsecylinder\nSkandinavisk Oval med udstandsning til låsecylinder"]
["Profil","A = \nEuroprofil, \nSwiss Round,\n\nB =\nScandinavian Oval\n\nC =\nEuroprofil mit Mechanical Override (MO)\n\nD =\nSwiss Round mit Mechanical Override (MO)\n\nE =\nScandinavian Oval mit Mechanical Override (MO)","A = \nEuroprofile, \nSwiss Round,\n\nB =\nScandinavian Oval\n\nC =\nEuroprofile with Mechanical Override (MO)\n\nD =\nSwiss Round with Mechanical Override (MO)\n\nE =\nScandinavian Oval with Mechanical Override (MO)","A = \nprofil européen, \nprofil suisse,\n\nB =\nOvale scandinave\n\nC =\nprofil européen avec Verrouillage mécanique (VM)\n\nD =\nprofil suisse avec Verrouillage mécanique (VM)\n\nE =\nOvale scandinave avec verrouillage mécanique (VM)","A = \nprofilo europeo, \ntondo svizzero,\n\nB =\nScandinavian Oval\n\nC =\nprofilo europeo con mechanical override (MO)\n\nD =\ntondo svizzero con mechanical override (MO)\n\nE =\nScandinavian Oval con Mechanical Override (MO)","A = \nEuro profiel, \nSwiss Round,\n\nB =\nScandinavian Oval\n\nC =\nEuro profiel met mechanical Override (MO)\n\nD =\nSwiss Round met mechanical Override (MO)\n\nE =\nScandinavian Oval met Mechanical Override (MO)","A = \nEuroprofil, \nSchweizisk Rund,\n\nB =\nSkandinavisk Oval\n\nC =\nEuroprofil med udstandsning til låsecylinder\n\nD =\nSchweizisk Rund med udstandsning til låsecylinder\n\nE =\nSkandinavisk Oval med udstandsning til låsecylinder"]
["Türdicke","Für PZ-Profil / Swiss Round:\nS = 39-60 mm\nM = 59-80 mm\nL = 79-100 mm\n\nfür Scandinavian Oval Profil:\nS = 33-50 mm\nM = 49-70 mm\nL = 69-94 mm","for Europrofile / Swiss Round:\nS = 39-60 mm\nM = 59-80 mm\nL = 79-100 mm\n\nfor SO lock type:\nS = 33-50 mm\nM = 49-70 mm\nL = 69-94 mm","pour type de profil européen / profil suisse:\nS = 39-60 mm\nM = 59-80 mm\nL = 79-100 mm\n\npour type de serrure SO (Ovale scandinave):\nS = 33-50 mm\nM = 49-70 mm\nL = 69-94 mm","for profilo europeo:\nS = 39-60 mm\nM = 59-80 mm\nL = 79-100 mm\n\nfor Scandinavian Oval profilo:\nS = 33-50 mm\nM = 49-70 mm\nL = 69-94 mm","voor Euro profiel / Swiss Round:\nS = 39-60 mm\nM = 59-80 mm\nL = 79-100 mm\n\nvoor Scandinavian Oval profiel:\nS = 33-50 mm\nM = 49-70 mm\nL = 69-94 mm","til Europrofil / Schweizisk Rund:\nS = 39-60 mm\nM = 59-80 mm\nL = 79-100 mm\n\ntil Skandinavisk Oval:\nS = 33-50 mm\nM = 49-70 mm\nL = 69-94 mm"]
["Vierkant","07 = 7 mm\n08 = 8 mm\nF8 = 8 mm (feuerhemmend, nur für Europrofil)\n09 = 9 mm (feuerhemmend)\n10 = 10 mm","07 = 7 mm\n08 = 8 mm\nF8 = 8 mm (Fire-retardant,for Europrofile only)\n09 = 9 mm (Fire-retardant)\n10 = 10 mm","07 = 7 mm\n08 = 8 mm\nF8 = 8 mm (coupe-feu, seulement pour profil européen)\n09 = 9 mm (coupe-feu)\n10 = 10 mm","07 = 7 mm\n08 = 8 mm\nF8 = 8 mm (Versione ignifuga, solo per profilo europeo)\n09 = 9 mm (Versione ignifuga)\n10 = 10 mm","07 = 7 mm\n08 = 8 mm\nF8 = 8 mm (Brandwerende versie, alleen voor Euro profiel)\n09 = 9 mm (Brandwerende versie)\n10 = 10 mm","07 = 7 mm\n08 = 8 mm\nF8 = 8 mm (Brandhæmmende, kun for Europrofil)\n09 = 9 mm (Brandhæmmende)\n10 = 10 mm"]
["Befestigung","A = SnapIn schmal (41mm)\nB = SnapIn breit (53mm)\nC = Konvent. Befestigung schmal (41mm)\nD = Konvent. Befestigung breit (53mm)\nE = Konvent. Befestigung MO - innen und außen Ausschnitt - schmal (41mm)\nF = Konvent. Befestigung MO - innen und außen Ausschnitt - breit (53mm)\nG = Konvent. Befestigung MO - innen blind, außen Ausschnitt - schmal (41mm)\nH = Konvent. Befestigung MO - innen blind, außen Ausschnitt - breit (53mm)\nI = Konvent. Befestigung MO - innen Ausschnitt, außen blind - schmal (41mm)\nJ = Konvent. Befestigung MO - innen Ausschnitt, außen blind - breit (53mm)\nK = Konvent. Befestigung MO - innen und außen blind - schmal (41mm)\nL = Konvent. Befestigung MO - innen und außen blind - breit (53mm)","A = SnapIn narrow (41mm)\nB = SnapIn wide (53mm)\nC = Conventional Fastening Narrow (41mm)\nD = Conventional Fastening Wide (53mm)\nE = Conventional Fastening MO - inside and outside cylinder recess - narrow (41mm)\nF = Conventional Fastening MO - inside and outside cylinder recess - wide (53mm)\nG = Conventional Fastening MO - inside blind, outside cylinder recess - narrow (41mm)\nH = Conventional Fastening MO - inside blind, outside cylinder recess - wide (53mm)\nI = Conventional Fastening MO - inside cylinder recess, outside blind - narrow (41mm)\nJ = Conventional Fastening MO - inside cylinder recess, outside blind - wide (53mm)\nK = Conventional Fastening MO - inside and outside blind - narrow (41mm)\nL = Conventional Fastening MO - inside and outside blind - wide (53mm)","A = SnapIn / étroit (41 mm)\nB = SnapIn / large (53 mm)\nC = Fixation conventionnelle / étroit (41 mm)\nD = Fixation conventionnelle / large (53 mm)\nE = Fixation conventionnelle VM – perçage à l’intérieur et à l’extérieur / étroit (41 mm)\nF = Fixation conventionnelle VM – perçage à l’intérieur et à l’extérieur / large (53 mm)\nG = Fixation conventionnelle VM – aucun perçage à l’intérieur/perçage à l’extérieur / étroit (41 mm)  \nH = Fixation conventionnelle VM – aucun perçage à l’intérieur/perçage à l’extérieur / large (53 mm)\nI = Fixation conventionnelle VM – perçage à l’intérieur/aucun perçage à l’extérieur / étroit (41 mm) \nJ = Fixation conventionnelle VM – perçage à l’intérieur/aucun perçage à l’extérieur / large (53 mm)\nK = Fixation conventionnelle VM – aucun perçage à l’intérieur et à l’extérieur / étroit (41 mm)  \nL = Fixation conventionnelle VM – aucun perçage à l’intérieur et à l’extérieur / large (53 mm)","A=SnapIn coprimaniglia stretto (41 mm)\nB=SnapIn coprimaniglia largo (53 mm)\nC = Fissaggio convenzionale coprimaniglia stretto (41 mm)\nD = Fissaggio convenzionale coprimaniglia largo (53 mm)\nE = Fissaggio convenzionale mO – interno ed esterno con incavo coprimaniglia stretto (41 mm)\nF = Fissaggio convenzionale mO – interno ed esterno con incavo coprimaniglia largo (53 mm)\nG = Fissaggio convenzionale mO – interno senza incavo/esterno con incavo coprimaniglia stretto (41 mm)   \nH = Fissaggio convenzionale mO – interno senza incavo/esterno con incavo coprimaniglia largo (53 mm)\nI = Fissaggio convenzionale mO – interno con incavo/esterno senza incavo coprimaniglia stretto (41 mm) \nJ = Fissaggio convenzionale mO – interno con incavo/esterno senza incavo coprimaniglia largo (53 mm)\nK = Fissaggio convenzionale mO –interno ed esterno senza incavo coprimaniglia stretto (41 mm)  \nL = Fissaggio convenzionale mO –interno ed esterno senza incavo coprimaniglia largo (53 mm)","A = SnapIn smal (41 mm)\nB = SnapIn breed (53 mm)\nC = Conventionele bevestiging smal (41 mm)\nD = Conventional bevestiging breed (53mm)\nE = Conventionele bevestiging MO – binnen en buiten uitsparing smal (41 mm)\nF = Conventionele bevestiging MO – binnen en buiten uitsparing breed (53 mm)\nG = Conventionele bevestiging MO – binnen blind/buiten uitsparing smal (41 mm)  \nH = Conventionele bevestiging MO – binnen blind/buiten uitsparing breed (53 mm)\nI = Conventionele bevestiging MO – binnen uitsparing/buiten blind smal (41 mm) \nJ = Conventionele bevestiging MO – binnen uitsparing/buiten blind breed (53 mm)\nK = Conventionele bevestiging MO – binnen en buiten blind smal (41 mm)  \nL = Conventionele bevestiging MO – binnen en buiten blind breed (53 mm)","A = SnapIn smal (41mm)\nB = SnapIn bred (53mm)\nC = Konventionel Fastgørelse smal (41mm)\nD = Konventionel Fastgørelse bred (53mm)\nE = Konventionel Fastgørelse MO - indvendig og udvendig cylinder udstandsning - smal (41mm)\nF = Konventionel Fastgørelse MO - indvendig og udvendig cylinder udstandsning - bred (53mm)\nG = Konventionel Fastsgørelse MO - indvendig blændet, udvendig udstandsning - smal (41mm)\nH = Konventionel Fastgørelse MO - indvendig blændet, udvendig udstandsning - bred (53mm)\nI = Konventionel Fastgørelse MO - indvendig udstandsning, udvendig blændet - smal (41mm)\nJ = Konventionel Fastgørelse MO - indvendig udstandsning, udvendig blændet - bred (53mm)\nK = Konventionel Fastgørelse MO - indvendig og udvendig blændet - smal (41mm)\nL = Konventionel Fastgørelse MO - indvendig og udvendig blændet - bred (53mm)"]
["Entfernung","00 = Konventionelle Befestigung (Version: C, D, K, L)\n70 = 70 mm\n72 = 72 mm\n75 = 75 mm\n78 = 78 mm\n85 = 85 mm\n88 = 88 mm\n90 = 90 mm\n92 = 92 mm\n94 = 94 mm (nur für Swiss Round)\n96 = 96 mm (nur für Scandinavian Oval)\n05 = 105 mm (nur für Scandinavian Oval)","00 = Conventional Fastening (Version: C, D, K, L)\n70 = 70 mm\n72 = 72 mm\n75 = 75 mm\n78 = 78 mm\n85 = 85 mm\n88 = 88 mm\n90 = 90 mm\n92 = 92 mm\n94 = 94 mm (only for Swiss Round)\n96 = 96 mm (only for Scandinavian Oval) \n05 = 105 mm (only for Scandinavian Oval)","00 = Fixation conventionnelle  (Variante C, D, K, L)\n70 = 70 mm\n72 = 72 mm\n75 = 75 mm\n78 = 78 mm\n85 = 85 mm\n88 = 88 mm\n90 = 90 mm\n92 = 92 mm\n94 = 94 mm (seulement pour profil suisse)\n96 = 96 mm (seulement pour ovale scandinave)\n05 = 105 mm (seulement pour ovale scandinave)","00 =  fissaggio convenzionale versione C, D, K, L)\n70 = 70 mm\n72 = 72 mm\n75 = 75 mm\n78 = 78 mm\n85 = 85 mm\n88 = 88 mm\n90 = 90 mm\n92 = 92 mm\n94 = 94 mm (solo per tondo svizzero)\n96 = 96 mm (solo per Scandinavian Oval)\n05 = 105 mm (solo per Scandinavian Oval)","00 = conventionele bevestiging (versie C, D, K, L)\n70 = 70 mm\n72 = 72 mm\n75 = 75 mm\n78 = 78 mm\n85 = 85 mm\n88 = 88 mm\n90 = 90 mm\n92 = 92 mm\n94 = 94 mm (alleen voor Swiss round)\n96 = 96 mm (alleen voor Scandinavian Oval)\n05 = 105 mm (alleen voor Scandinavian Oval)","00 = Konventionel Fastgørelse (Version: C, D, K, L)\n70 = 70 mm\n72 = 72 mm\n75 = 75 mm\n78 = 78 mm\n85 = 85 mm\n88 = 88 mm\n90 = 90 mm\n92 = 92 mm\n94 = 94 mm (kun til Schweizisk Rund)\n96 = 96 mm (kun til Skandinavisk Oval) \n05 = 105 mm (kun til Skandinavisk Oval)"]
["Version","0 = gekuppelt (ohne Elektronik)\n1 = einseitig kuppelnd (ohne Door Monitoring)\n2 = einseitig kuppelnd DM (Door Monitoring / SV Sensorik)\n3 = einseitig kuppelnd DM S (Door Monitoring / Schlosssensorik)\n4 = einseitig kuppelnd DS (Door Monitoring / Drückersensor)","0 = Engaged (for Smart Handles without electronics only)\n1 = Engaging on one side (without Door Monitoring)\n2 = Engaging on one side DM (Door Monitoring / SV sensor)\n3 = Engaging on one side  DM S (Door Monitoring / sensor locks)\n4 = Engaging on one side  DS (Door Monitoring / handle sensor)","0 = embrayé (uniquement pour plaques béquilles sans électronique)\n1 = embrayage d'un seul côté (sans Door Monitoring)\n2 = embrayage d'un seul côté (Door Monitoring / capteur SV)\n3 = embrayage d'un seul côté (Door Monitoring / capteur externe)\n4 = embrayage d'un seul côté (Door Monitoring / capteur poignée)\n\n","0 = Sempre innestata (Solo per smartHandle senza elettronica)\n1 = Innesto sul solo lato esterno (Senza DoorMonitoring)\n2 = Innesto sul solo lato esterno (Door Monitoring / Sensore SV)\n3 = Innesto sul solo lato esterno (Door Monitoring / Sensore esterno)\n4 = Innesto sul solo lato esterno (Door Monitoring / Sensore sulla leva)","0 = gekoppeld (zonder electronica)                                             1 = eenzijdig gekoppeld zonder deurstand signalering)\n2 = eenzijdig gekoppeld (Deurstand signalering/ SV Sensor)\n3 = eenzijdig gekoppeld (Deurstand signalering / externe Sensor)\n4 = eenzijdig gekoppeld (Deurstand signalering / Kruk sensor)","0 = Aktiveret (kun til Smart Handles uden elektronik)\n1 = Aktiv på én side (til alle Smart Handles med elektronik)\n2 = Ensidigt koblende (dør monitorering / SV sensor)\n3 = Ensidigt koblende (dør monitorering / sensor lås)\n4 = Ensidigt koblende (dør monitorering / dørgrebs sensor)\n"]
["Drücker außen","A = L-Form rund\nB = L-Form Gehrung\nC = U-Form rund\nD = U-Form Gehrung\nE = U-Form rund gekröpft\nF = U-Form Gehrung gekröpft\nG = Ulmer Klinke\nH = Ulmer Klinke gekröpft","A = L-shape curved\nB = L-shape mitre\nC = U-shape curved\nD = U-shape mitre\nE = U-shape curved and cranked\nF = U-shape mitre and cranked\nG = Ulm design handle\nH = Ulm design handle and cranked","A = forme en L arrondie\nB =  forme en L rectangulaire\nC = forme en U arrondie\nD = forme en U rectangulaire\nE = forme en U arrondie & coudée\nF = forme en U rectangulaire & coudée\nG = poignée Ulmer\nH = poignée Ulmer & coudée","A = forma a L curvata tondeggiante\nB = forma a L piegata ad angolo retto\nC = forma a U curvata tondeggiante\nD = forma a U piegata ad angolo retto\nE = forma a U con rientro teondeggiante\nF = forma a U con rientro ad angolo retto\nG = Leva Ulmer\nH = Leva Ulmer ad angolo retto","A = L-vorm rond gebogen\nB =  L-vorm verstek\nC = U-vorm rond gebogen\nD = U-vorm verstek\nE = U-vorm rond gebogen & verkropt\nF = U-vorm verstek & verkropt\nG = Ulm Kruk\nH = Ulm Kruk & verkropt","A = L-form rundet\nB = L-form mitre (retvinklet)\nC = U-form rundet\nD = U-form mitre (retvinklet)\nE = U-form rundet & forkrøbbet\nF = U-form mitre (retvinklet) & forkrøbbet\nG = Ulm dørgreb\nH = Ulm dørgreb & forkrøbbet"]
["Drücker innen","A = L-Form rund\nB = L-Form Gehrung\nC = U-Form rund\nD = U-Form Gehrung\nE = U-Form rund gekröpft\nF = U-Form Gehrung gekröpft\nG = Ulmer Klinke\nH = Ulmer Klinke gekröpft","A = L-shape curved\nB = L-shape mitre\nC = U-shape curved\nD = U-shape mitre\nE = U-shape curved and cranked\nF = U-shape mitre and cranked\nG = Ulm design handle\nH = Ulm design handle and cranked","A = forme en L arrondie\nB =  forme en L rectangulaire\nC = forme en U arrondie\nD = forme en U rectangulaire\nE = forme en U arrondie & coudée\nF = forme en U rectangulaire & coudée\nG = poignée Ulmer\nH = poignée Ulmer & coudée","A = forma a L curvata tondeggiante\nB = forma a L piegata ad angolo retto\nC = forma a U curvata tondeggiante\nD = forma a U piegata ad angolo retto\nE = forma a U con rientro teondeggiante\nF = forma a U con rientro ad angolo retto\nG = Leva Ulmer\nH = Leva Ulmer ad angolo retto","A = L-vorm rond gebogen\nB =  L-vorm verstek\nC = U-vorm rond gebogen\nD = U-vorm verstek\nE = U-vorm rond gebogen & verkropt\nF = U-vorm verstek & verkropt\nG = Ulm Kruk\nH = Ulm Kruk & verkropt","A = L-form rundet\nB = L-form mitre (retvinklet)\nC = U-form rundet\nD = U-form mitre (retvinklet)\nE = U-form rundet & forkrøbbet\nF = U-form mitre (retvinklet) & forkrøbbet\nG = Ulm dørgreb\nH = Ulm dørgreb & forkrøbbet"]
["Oberfläche","1 = Edelstahl gebürstet\n3 = Messing","1 = brushed stainless steel\n3 = brass","1 = Inox brossé\n3 = Laiton","1 = acciaio inox spazzolato\n3 = ottone","1 = Geborsteld RVS\n3 = Messing","1 = Børstet rustfri stål\n3 = Messing"]
["Lesetechnik","0 = ohne Elektronik\nA = Wireless Online\n3 = Virtual CardNetwork","0 = Without electronics\nA = Wireless Online\n3 = Virtual CardNetwork","0 = Sans électronique\nA = Wireless Online\n3 = Virtual CardNetwork","0 =  senza elettronica\nA = Wireless Online\n3 = Virtual CardNetwork","0 = zonder elektronica\nA = Wireless Online\n3 = Virtual CardNetwork","0 = Uden elektronik\nA = Wireless Online\n3 = Virtual CardNetwork"]
[]
["Optionen","WP = weatherproof (nur Außenseite)","WP = Weatherproof (only outside part of SH)","WP =  version étanche","WP = versione resistente alle intemperie","WP = Weerbestendige versie","WP = Vandtæt (IP 65)"]
[]
["Änderung Profilname/SmartHandle Typ/ Wireless online…","Bei Änderung dieser Zelle werden die Eingaben in der Zeile gelöscht.","Changes to this text field result in a resetting of the complete line.","En cas de modifications dans cette cellule, les données de la ligne seront supprimées.","in caso di cambio del testo di questa cella, il contenuto di questa riga viene cancellato","In geval van wijzigingen in dit tekstveld zal de inhoud worden gewist.","Ændringer i dette tekstfelt vil resultere i en nulstilling af hele linjen."]
["Änderung Besfestigung","Bei Änderung dieser Zelle werden die Eingaben zur \"Entfernung\" gelöscht.","Changes to this text field result in a resetting of \"Centre Distance\".","En cas de modifications dans cette cellule, les données concernant la \"distance\" seront supprimées.","In caso di cambio del testo di questa cella, il contenuto della cella \"interasse\" verrà cancellato","In geval van wijzigingen in dit tekstveld zal de \"h.o.h maat\" worden gewist.","Ændringer i dette tekstfelt vil resultere i en nulstilling af \"Centerafstand\"."]
["Änderung Version","Bei Änderung dieser Zelle werden die Eingaben zur \"Lesetechnik\" sowie \"Optionen\" gelöscht.","Changes to this text field result in a resetting of \"Reading Technology\" and \"Options\".","En cas de modifications dans cette cellule, les données concernant la \"technique de lecture\" et \"options\" seront supprimées.","In caso di cambio del testo di questa cella, il contenuto della cella \"tecnologia di lettura\" e \"opzioni\" verrà cancellato","In geval van wijzigingen in dit tekstveld zal de \"leestechniek\"  en \"opties\" worden gewist.","Ændringer i dette tekstfelt vil resultere i en nulstilling af \" Læseteknologi\" og \"Indstillinger\"."]
["Änderung Lesetechnik","Bei Änderung dieser Zelle werden die Eingaben zu \"Optionen\" gelöscht.","In case of change in this text field the content in field \"Options\" will be reset.","En cas de modifications dans cette cellule, les données concernant l'option \"options\" seront supprimées.","In caso di cambio del testo di questa cella, il contenuto della cella \"opzioni\" verrà cancellato","In geval van wijzigingen in dit tekstveld zal \"opties\" worden gewist.","Ændringer i dette tekstfelt vil resultere i en nulstilling af \"Indstillinger\"."]
["Änderung  Türdicke","Bei Änderung dieser Zelle werden die Eingaben zu \"Vierkant\" gelöscht.","In case of change in this text field the content in field \"Spindle Square\" will be reset.","En cas de modifications dans cette cellule, les données concernant l'option \"Carré\" seront supprimées.","In caso di modifica del testo in questo campo, il contenuto del campo “Quadro maniglia” verrà cancellato. ","In geval van wijzigingen in dit tekstveld zal \"Vierkant stift\" worden gewist.","Ændringer i dette tekstfelt vil resultere i en nulstilling af \"Grebspind\"."]
["Änderung Vierkant","Bei Änderung dieser Zelle werden die Eingaben zu \"Version\" gelöscht.","In case of change in this text field the content in field \"version\" will be reset.","En cas de modifications dans cette cellule, les données concernant l'option \"version\" seront supprimées.","In caso di modifica del testo in questo campo, il contenuto del campo “Versione” verrà cancellato. ","In geval van wijzigingen in dit tekstveld zal \"Versie\" worden gewist.","Ændringer i dette tekstfelt vil resultere i en nulstilling af \"Version\"."]
["Programmierung","Programmiergerät SmartIntego\nProgrammiersoftware SmartIntego","Programming device SmartIntego\nProgramming software SmartIntego","Programming device SmartIntego\nProgramming software SmartIntego","Programming device SmartIntego\nProgramming software SmartIntego","Programming device SmartIntego\nProgramming software SmartIntego","Konfigurationsenhed SmartIntego\nKonfigurationssoftware SmartIntego"]
["GatewayNodes","SmartIntego GatewayNode zur Umsetzung von der RS 485 Schnittstelle auf 868 MHz\n\nSmartIntego GatewayNode zur Reichweitenverlängerung der 868 MHz Funkstrecke\n\nSmartIntego GatewayNode zur Umsetzung von Ethernet (TCP/IP) auf 868 MHz","SmartIntego GatewayNode to convert from RS485 port to 868 MHz\n\nSmartIntego GatewayNode to extend range of 868 MHz transmission path\n\nSmartIntego GatewayNode to convert from Ethernet (TCP/IP) to 868 MHz","SmartIntego GatewayNode to convert from RS485 port to 868 MHz\n\nSmartIntego GatewayNode to extend range of 868 MHz transmission path\n\nSmartIntego GatewayNode to convert from Ethernet (TCP/IP) to 868 MHz","SmartIntego GatewayNode to convert from RS485 port to 868 MHz\n\nSmartIntego GatewayNode to extend range of 868 MHz transmission path\n\nSmartIntego GatewayNode to convert from Ethernet (TCP/IP) to 868 MHz","SmartIntego GatewayNode to convert from RS485 port to 868 MHz\n\nSmartIntego GatewayNode to extend range of 868 MHz transmission path\n\nSmartIntego GatewayNode to convert from Ethernet (TCP/IP) to 868 MHz","SmartIntego GatewayNode til konvertering fra RS485 port til 868 MHz\n\nSmartIntego GatewayNode til at udvide rækkevidden af 868 MHz radioforbindelse\n\nSmartIntego GatewayNode til konvertering fra Ethernet (TCP/IP) til 868 MHz"]

{"sheet":"CommentsZyl","index":9,"n_rows":13,"n_cols":7,"rows_kept":13,"cut":false,"hidden":true,"merged":[]}
["Sprache","Deutsch","English","Français","Italiano","Nederlands","Dansk"]
["Profil","Europrofil\nSwiss Round\nScandinavian Oval\nScandinavian Round","Europrofile\nSwiss Round\nScandinavian Oval\nScandinavian Round","Profil européen\nProfil suisse\nOvale scandinave\nRond scandinave","profilo europeo\ntondo svizzero\nScandinavian Oval\nScandinavian Round","Euro profiel\nSwiss Round\nScandinavian Oval\nScandinavian Round","Europrofil\nSchweizisk Rund\nSkandinavisk Oval\nSkandinavisk Rund"]
["Wireless online / Virtual CardNetwork","Wireless Online\nVirtual CardNetwork","Wireless Online\nVirtual CardNetwork","Wireless Online\nVirtual CardNetwork","Wireless Online\nVirtual CardNetwork","Wireless Online\nVirtual CardNetwork","Wireless Online\nVirtual CardNetwork"]
["Variante","M(I).CO - Comfort\nMI.FD - Freidrehend\nM(I).AP2.FD - Antipanik freidrehend\nMI.AP2.BL - Antipanik beidseitig lesend\nM(I).HZ - Halbzylinder\nA40.M(I) - Außenseite Scandinavian Oval/Round Zylinder\nI30 - Innenseite Scandinavian Oval/Round Zylinder","M(I).CO - Comfort\nMI.FD - freely rotating\nM(I).AP2.FD - Antipanic freely rotating\nMI.AP2.BL - Antipanik reading on both sides\nM(I).HZ - half cylinder\nA40.M(I) - outside version of Scandinavian Oval/Round Zylinder\nI30 - inside version of Scandinavian Oval/Round Zylinder","M(I).CO - Comfort\nMI.FD - Rotation libre des deux côtés\nM(I).AP2.FD - Anti-panique rotation libre des deux côtés\nMI.AP2.BL - Anti-panique (reading on both sides)\nM(I).HZ - Demi-cylindre\nA40.M(I) - outside version of Ovale scandinave/Rond cylindre\nI30 - inside version of Ovale scandinave/Rond cylindre","M(I).CO - Comfort\nMI.FD - Freidrehend\nM(I).AP2.FD - Antipanik freidrehend\nMI.AP2.BL - Antipanik beidseitig lesend\nM(I).HZ - Halbzylinder\nA40.M(I) - Außenseite Scandinavian Oval/Round Zylinder\nI30 - Innenseite Scandinavian Oval/Round Zylinder","M(I).CO - Comfort\nMI.FD - Freidrehend\nM(I).AP2.FD - Antipanik freidrehend\nMI.AP2.BL - Antipanik beidseitig lesend\nM(I).HZ - Halbzylinder\nA40.M(I) - Außenseite Scandinavian Oval/Round Zylinder\nI30 - Innenseite Scandinavian Oval/Round Zylinder","M(I).CO - Komfort\nMI.FD - frit roterende\nM(I).AP2.FD - Antipanik frit roterende\nMI.AP2.BL - Antipanik læser på begge sider\nM(I).HZ - halvcylinder\nA40.M(I) - udendørs version af Skandinavisk Oval/Rund cylinder\nI30 - indendørs version af Skandinavisk Oval/Rund cylinder"]
["Optionen",".DK = demontierbarer Knauf\n.MR = Multirast\n.MS = Messing\n.WP = Wetterfest",".DK = detachable knob\n.MR = Multi-point\n.MS = Brass\n.WP = Weatherproof",".DK = bouton démontable\n.MR = multi-enclenchements\n.MS = Laiton\n.WP = étanche",".DK = pomolo smontabile\n.MR = Multirast\n.MS = Ottone\n.WP = resistente alle intemperie",".DK = demonteerbare knop\n.MR = multirust-uitvoering\n.MS = Messing\n.WP = Weerbestendig",".DK = aftagelig knop\n.MR = Multi-point\n.MS = Messing\n.WP = Vejrbestandig (udendørs)"]
["Außenlänge","minimale Außenlänge 30 mm \n(.MR = 35 mm)","minimum outside length 30 mm\n(MR = 35 mm)","minimum outside length 30 mm\n(MR = 35 mm)","minimum outside length 30 mm\n(MR = 35 mm)","minimum outside length 30 mm\n(MR = 35 mm)","mindste udvendig længde 30 mm\n(.MR = 35 mm)"]
["Innenlänge","minimale Innenlänge 30 mm \n(.WP = 35 mm)","minimum inside length 30 mm\n(WP = 35 mm)","minimum inside length 30 mm\n(WP = 35 mm)","minimum inside length 30 mm\n(WP = 35 mm)","minimum inside length 30 mm\n(WP = 35 mm)","mindste indvendig længde 30 mm\n(.WP = 35 mm)"]
[]
["Änderung Profil","Bei Änderung dieser Zelle werden die Eingaben in der Zeile gelöscht.","Changes to this text field result in a resetting of the complete line.","En cas de modifications dans cette cellule, les données de la ligne seront supprimées.","in caso di cambio del testo di questa cella, il contenuto di questa riga viene cancellato","In geval van wijzigingen in dit tekstveld zal de inhoud worden gewist.","Ændringer i dette tekstfelt vil resultere i en nulstilling af hele linjen."]
["wireless online / virtual CardNetwork","Bei Änderung dieser Zelle werden die Eingaben zur \"Variante\", \"Optionen\", \"Außenlänge\" sowie \"Innenlänge\" gelöscht.","In case of change in this text field the content in field, \"variant\", \"options\",  \"outside length\" and \"inside length\" will be reset.","En cas de modifications dans cette cellule, les données concernant la \"variant\", \"options\", \"Außenlänge\" et \"Innenlänge\" seront supprimées.","In caso di cambio del testo di questa cella, il contenuto della cella \"variant\", \"opzioni\", \"Außenlänge\" e \"Innenlänge\" verrà cancellato","In geval van wijzigingen in dit tekstveld zal de \"variant\", \"opties\", \"Außenlänge\" en \"Innenlänge\" worden gewist.","Ændringer i dette tekstfelt vil resultere i en nulstilling af \"variant\", \"Indstillinger\", \"udvendig længde\" og \"Indvendig længde\"."]
["Änderung Variante","Bei Änderung dieser Zelle werden die Eingaben zur \"Optionen\", \"Außenlänge\" sowie \"Innenlänge\" gelöscht.","In case of change in this text field the content in field \"options\",  \"outside length\" and \"inside length\" will be reset.","En cas de modifications dans cette cellule, les données concernant la \"options\", \"Außenlänge\" et \"Innenlänge\" seront supprimées.","In caso di cambio del testo di questa cella, il contenuto della cella \"opzioni\", \"Außenlänge\" e \"Innenlänge\" verrà cancellato","In geval van wijzigingen in dit tekstveld zal de \"opties\", \"Außenlänge\" en \"Innenlänge\" worden gewist.","Ændringer i dette tekstfelt vil resultere i en nulstilling af \"Indstillinger\", \"udvendig længde\" og \"Indvendig længde\"."]
["Änderung Optionen","Bei Änderung dieser Zelle werden die Eingaben zu \"Außenlänge\" sowie \"Innenlänge\" gelöscht.","In case of change in this text field the content in field \"outside length\" and \"inside length\" will be reset.","En cas de modifications dans cette cellule, les données concernant l'option \"G1/G2\" et \"options\" seront supprimées.","In caso di cambio del testo di questa cella, il contenuto della cella \"Außenlänge\" e \"Innenlänge\" verrà cancellato","In geval van wijzigingen in dit tekstveld zal \"Außenlänge\" en \"Innenlänge\" worden gewist.","Ændringer i dette tekstfelt vil resultere i en nulstilling af \"udvendig længde\" og \"Indvendig længde\"."]
["Änderung "]

{"sheet":"Bilder_SI_Zylinder","index":10,"n_rows":1,"n_cols":5,"rows_kept":1,"cut":false,"hidden":true,"merged":[]}
["Zylinder","Europrofil","Swiss_Round","Scandinavian_Oval","Scandinavian_Round"]

{"sheet":"Bilder SH-Cover für Anzeige","index":11,"n_rows":38,"n_cols":5,"rows_kept":38,"cut":false,"hidden":true,"merged":[]}
["schmal","Außenseite",null,null,"Innenseite"]
[null,"SI.SH.CS",null,null,"SI.SH.CS"]
[null,"SI.SH.CSP",null,null,"SI.SH.CS"]
[null,"SI.SH.CS.XX",null,null,"SI.SH.CS.XX"]
[null,"SI.SH.CSP.XX",null,null,"SI.SH.CS.XX"]
[null,"SI.SH.CS.SO",null,null,"SI.SH.CS.SO"]
[null,"SI.SH.CSP.SO",null,null,"SI.SH.CS.SO"]
[null,"SI.SH.CS.SO.105",null,null,"SI.SH.CS.SO.105"]
[null,"SI.SH.CSP.SO.105",null,null,"SI.SH.CS.SO.105"]
[null,"SI.SH.CS.SR",null,null,"SI.SH.CS.SR"]
[null,"SI.SH.CSP.SR",null,null,"SI.SH.CS.SR"]
[null,"SI.SH.CS.SR.A78",null,null,"SI.SH.CS.SR.I78"]
[null,"SI.SH.CSP.SR.A78",null,null,"SI.SH.CS.SR.I78"]
[null,"SI.SH2.CSP",null,null,"SI.SH.CS"]
[null,"SI.SH2.CSP.XX",null,null,"SI.SH.CS.XX"]
[null,"SI.SH2.CSP.SO",null,null,"SI.SH.CS.SO"]
[null,"SI.SH2.CSP.SO.105",null,null,"SI.SH.CS.SO.105"]
[null,"SI.SH2.CSP.SR",null,null,"SI.SH.CS.SR"]
[null,"SI.SH2.CSP.SR.A78",null,null,"SI.SH.CS.SR.I78"]
["breit","SI.SH.CB",null,null,"SI.SH.CB"]
[null,"SI.SH.CBP",null,null,"SI.SH.CB"]
[null,"SI.SH.CB.XX",null,null,"SI.SH.CB.XX"]
[null,"SI.SH.CBP.XX",null,null,"SI.SH.CB.XX"]
[null,"SI.SH.CB.SO",null,null,"SI.SH.CB.SO"]
[null,"SI.SH.CBP.SO",null,null,"SI.SH.CB.SO"]
[null,"SI.SH.CB.SO.105",null,null,"SI.SH.CB.SO.105"]
[null,"SI.SH.CBP.SO.105",null,null,"SI.SH.CB.SO.105"]
[null,"SI.SH.CB.SR",null,null,"SI.SH.CB.SR"]
[null,"SI.SH.CBP.SR",null,null,"SI.SH.CB.SR"]
[null,"SI.SH.CB.SR.A78",null,null,"SI.SH.CB.SR.I78"]
[null,"SI.SH.CBP.SR.A78",null,null,"SI.SH.CB.SR.I78"]
[null,"SI.SH2.CBP",null,null,"SI.SH.CB"]
[null,"SI.SH2.CBP.XX",null,null,"SI.SH.CB.XX"]
[null,"SI.SH2.CBP.SO",null,null,"SI.SH.CB.SO"]
[null,"SI.SH2.CBP.SO.105",null,null,"SI.SH.CB.SO.105"]
[null,"SI.SH2.CBP.SR",null,null,"SI.SH.CB.SR"]
[null,"SI.SH2.CBP.SR.A78",null,null,"SI.SH.CB.SR.I78"]
[null,"XXX",null,null,"XXX"]

{"sheet":"Bilder SH-Cover sortiert","index":12,"n_rows":14,"n_cols":16,"rows_kept":14,"cut":false,"hidden":true,"merged":[[0,0,1,0],[0,1,0,5],[0,8,0,12],[1,1,1,2],[1,4,1,5],[1,8,1,9],[1,11,1,12]]}
[null,"schmal",null,null,null,null,null,null,"breit"]
[null,"für Außenseite",null,null,"für Innenseite",null,null,null,"für Außenseite",null,null,"für Innenseite"]
[null,"SI.SH.CSP",null,null,"SI.SH.CS",null,null,null,"SI.SH.CBP",null,null,"SI.SH.CB",null,null,null,{"$f":"SI_Programming_Gateways!$J$235","v":"noch zu übersetzen"}]
[null,"SI.SH.CSP.XX",null,null,"SI.SH.CS.XX",null,null,null,"SI.SH.CBP.XX",null,null,"SI.SH.CB.XX"]
[null,"SI.SH.CSP.SO",null,null,"SI.SH.CS.SO",null,null,null,"SI.SH.CBP.SO",null,null,"SI.SH.CB.SO"]
[null,"SI.SH.CSP.SO.105",null,null,"SI.SH.CS.SO.105",null,null,null,"SI.SH.CBP.SO.105",null,null,"SI.SH.CB.SO.105"]
[null,"SI.SH.CSP.SR",null,null,"SI.SH.CS.SR",null,null,null,"SI.SH.CBP.SR",null,null,"SI.SH.CB.SR"]
[null,"SI.SH.CSP.SR.A78",null,null,"SI.SH.CS.SR.I78",null,null,null,"SI.SH.CBP.SR.A78",null,null,"SI.SH.CB.SR.I78"]
[null,"SI.SH2.CSP",null,null,"SI.SH.CS",null,null,null,"SI.SH2.CBP",null,null,"SI.SH.CB"]
[null,"SI.SH2.CSP.XX",null,null,"SI.SH.CS.XX",null,null,null,"SI.SH2.CBP.XX",null,null,"SI.SH.CB.XX"]
[null,"SI.SH2.CSP.SO",null,null,"SI.SH.CS.SO",null,null,null,"SI.SH2.CBP.SO",null,null,"SI.SH.CB.SO"]
[null,"SI.SH2.CSP.SO.105",null,null,"SI.SH.CS.SO.105",null,null,null,"SI.SH2.CBP.SO.105",null,null,"SI.SH.CB.SO.105"]
[null,"SI.SH2.CSP.SR",null,null,"SI.SH.CS.SR",null,null,null,"SI.SH2.CBP.SR",null,null,"SI.SH.CB.SR"]
[null,"SI.SH2.CSP.SR.A78",null,null,"SI.SH.CS.SR.I78",null,null,null,"SI.SH2.CBP.SR.A78",null,null,"SI.SH.CB.SR.I78"]

{"sheet":"Langtext_Cover_Übers.","index":13,"n_rows":40,"n_cols":9,"rows_kept":40,"cut":false,"hidden":true,"merged":[]}
["Artikelnummer",null,null,"Artikelnummer","Deutsch","English","Français","Italiano","Nederlands"]
["SI.SH.CB","breites Cover / \nEuro-PZ",null,"SI.SH.CB","breites Cover / \nEuro-PZ","wide cover / \nEuro profile","plaque large  / profil européen","Cover larga /\nProfilo europeo","breed schild /\nEuro profiel"]
["SI.SH.CB.SO","breites Cover / \nScandinavian Oval",null,"SI.SH.CB.SO","breites Cover / \nScandinavian Oval","wide cover / \nScandinavian Oval","plaque large  / profil scandinave ovale","Cover larga /\nOvale scandinavo","breed schild /\nScandinavian Oval"]
["SI.SH.CB.SO.105","breites Cover / \nScandinavian Oval /\nmit Mechanical Override",null,"SI.SH.CB.SO.105","breites Cover / \nScandinavian Oval /\nmit Mechanical Override","wide cover / \nScandinavian Oval / \nwith mechanical override","plaque large / ovale scandinave / avec verrouillage mécanique","Cover larga /\nOvale Scnadinavo /\ncon override meccanico","breed schild /\nScandinavian Oval /\nmet Mechanical Override"]
["SI.SH.CB.SR","breites Cover / \nSwiss Round",null,"SI.SH.CB.SR","breites Cover / \nSwiss Round","wide cover / \nSwiss Round","plaque large /suisse rond","Cover larga / \nTondo svizzero","breed schild /\nSwiss Round"]
["SI.SH.CB.SR.A78","breites Cover / \nSwiss Round (Außenseite) /\nmit Mechanical Override",null,"SI.SH.CB.SR.A78","breites Cover / \nSwiss Round (Außenseite) /\nmit Mechanical Override","wide cover / \nSwiss Round (outside) / \nwith mechanical override","plaque large / suisse rond / avec verrouillage ménanique (extérieur)","Cover larga /\nTondo svizzero /\ncon override mecanico ( lato esterno )","breed schild /\nSwiss Round (buitenzijde) /\nmet Mechanical Override"]
["SI.SH.CB.SR.I78","breites Cover / \nSwiss Round (Innenseite) /\nmit Mechanical Override",null,"SI.SH.CB.SR.I78","breites Cover / \nSwiss Round (Innenseite) /\nmit Mechanical Override","wide cover / \nSwiss Round (inside) / \nwith mechanical override ","plaque large / suisse rond / avec verrouillage ménanique (intérieur)","Cover larga /\nTondo svizzero /\ncon override mecanico ( lato interno )","breed schild /\nSwiss Round (binnenzijde) /\nmet Mechanical Override"]
["SI.SH.CB.X","breites Cover / \nEuro-PZ / \nmit Mechanical Override",null,"SI.SH.CB.X","breites Cover / \nEuro-PZ / \nmit Mechanical Override","wide cover / \nEuro profile / \nwith mechanical override","plaque large / profil européen / avec verrouillage mécanique","Cover larga /\nProfilo europeo /\ncon override meccanico","breed schild /\nEuro profiel /\nmet Mechanical Override"]
["SI.SH.CBP","breites Cover / \nEuro-PZ / \nmit Kartenausschnitt",null,"SI.SH.CBP","breites Cover / \nEuro-PZ / \nmit Kartenausschnitt","wide cover / \nEuro profile / \nwith card reader insert","plaque large / profil européen / pour lecture  carte","Cover larga / \nProfilo europeo /\ncon inserto per lettura tessere","breed schild / \nEuro profiel / \nmet opbouw kaartlezer"]
["SI.SH.CBP.SO","breites Cover / \nScandinavian Oval / \nmit Kartenausschnitt",null,"SI.SH.CBP.SO","breites Cover / \nScandinavian Oval / \nmit Kartenausschnitt","wide cover / \nScandinavian Oval / \nwith card reader insert","plaque large / ovale scandinave / pour lecture carte","Cover larga / \nOvale Scandinavo /\ncon inserto per lettura tessere","breed schild / \nScandinavian Oval / \nmet opbouw kaartlezer"]
["SI.SH.CBP.SO.105","breites Cover / \nScandinavian Oval / \nmit Kartenausschnitt / \nmit Mechanical Override",null,"SI.SH.CBP.SO.105","breites Cover / \nScandinavian Oval / \nmit Kartenausschnitt / \nmit Mechanical Override","wide cover / \nScandinavian Oval / \nwith card reader insert / \nwith mechanical override","plaque large / ovale scandinave / pour lecture carte / avec verrouillage mécanique","Cover larga / \nOvale Scandinavo /\ncon inserto per lettura tessere /\ncon override meccanico","breed schild / \nScandinavian Oval / \nmet opbouw kaartlezer / \nmet mechanical override"]
["SI.SH.CBP.SR","breites Cover / \nSwiss Round / \nmit Kartenausschnitt",null,"SI.SH.CBP.SR","breites Cover / \nSwiss Round / \nmit Kartenausschnitt","wide cover / \nSwiss Round / \nwith card reader insert","plaque large / suisse rond / pour lecture carte","Cover larga /\nProfilo Svizzero /\ncon inserto per lettura tessere","breed schild / \nSwiss Round / \nmet opbouw kaartlezer"]
["SI.SH.CBP.SR.A78","breites Cover / \nSwiss Round (Außenseite) /\nmit Kartenausschnitt /\nmit Mechanical Override",null,"SI.SH.CBP.SR.A78","breites Cover / \nSwiss Round (Außenseite) /\nmit Kartenausschnitt /\nmit Mechanical Override","wide cover / \nSwiss Round (outside) / \nwith card reader insert / \nwith mechanical override ","plaque large / suisse rond / pour lecture carte / avec verrouillage mécanique (extérieur)","Cover larga /\nProfilo Svizzero /\ncon inserto per lettura tessere /\ncon ovverride meccanico ( lato esterno )","breed schild / \nSwiss Round (buitenzijde) / \nmet opbouw kaartlezer / \nmet mechanical override "]
["SI.SH.CBP.X","breites Cover / \nEuro-PZ / \nmit Kartenausschnitt / \nmit Mechanical Override",null,"SI.SH.CBP.X","breites Cover / \nEuro-PZ / \nmit Kartenausschnitt / \nmit Mechanical Override","wide cover / \nEuro profile / \nwith card reader insert / \nwith mechanical override","plaque large / profil européen / pour lecture  carte / avec verrouillage mécanique","Cover larga /\nProfilo Europeo /\ncon inserto per lettura tessere /\ncon override meccanico","breed schild / \nEuro profiel / \nmet opbouw kaartlezer / \nmet mechanical override"]
["SI.SH.CS","schmales Cover / \nEuro-PZ",null,"SI.SH.CS","schmales Cover / \nEuro-PZ","narrow cover / \nEuro profile","plaque étroite / profil européen","Cover stretta /\nProfilo Europeo","smal schild /\nEuro profiel"]
["SI.SH.CS.SO","schmales Cover / \nScandinavian Oval",null,"SI.SH.CS.SO","schmales Cover / \nScandinavian Oval","narrow cover / \nScandinavian Oval","plaque étroite / ovale scandinave","Cover stretta /\nOvale Scandinavo","smal schild /\nScandinavian Oval"]
["SI.SH.CS.SO.105","schmales Cover / \nScandinavian Oval /\nmit Mechanical Override",null,"SI.SH.CS.SO.105","schmales Cover / \nScandinavian Oval /\nmit Mechanical Override","narrow cover / \nScandinavian Oval / \nwith mechanical override","plaque étroite / ovale scandinave / avec verrouillage mécanique","Cover stretta /\nOvale Scandinavo /\ncon override meccanico","smal schild /\nScandinavian Oval /\nmet Mechanical Override"]
["SI.SH.CS.SR","schmales Cover / \nSwiss Round",null,"SI.SH.CS.SR","schmales Cover / \nSwiss Round","narrow cover / \nSwiss Round","plaque étroite / suisse rond","Cover stretta /\nTondo Svizzero","smal schild /\nSwiss Round"]
["SI.SH.CS.SR.A78","schmales Cover / \nSwiss Round (Außenseite) /\nmit Mechanical Override",null,"SI.SH.CS.SR.A78","schmales Cover / \nSwiss Round (Außenseite) /\nmit Mechanical Override","narrow cover / \nSwiss Round (outside) / \nwith mechanical override ","plaque étroite / suisse rond / avec verrouillage mécanique (extérieur)","Cover stretta /\nTondo Svizzero /\ncon override meccanico ( lato esterno )","smal schild /\nSwiss Round (buitenzijde) /\nmet Mechanical Override"]
["SI.SH.CS.SR.I78","schmales Cover / \nSwiss Round (Innenseite) /\nmit Mechanical Override",null,"SI.SH.CS.SR.I78","schmales Cover / \nSwiss Round (Innenseite) /\nmit Mechanical Override","narrow cover / \nSwiss Round (inside) / \nwith mechanical override ","plaque étroite / suisse rond / avec verrouillage mécanique (intérieur)","Cover stretta /\nTondo Svizzero /\ncon override meccanico ( lato interno )","smal schild /\nSwiss Round (binnenzijde) /\nmet Mechanical Override"]
["SI.SH.CS.X","schmales Cover / \nEuro-PZ / \nmit Mechanical Override",null,"SI.SH.CS.X","schmales Cover / \nEuro-PZ / \nmit Mechanical Override","narrow cover / \nEuro profile / \nwith mechanical override","plaque étroite /profil européen / avec verrouillage mécanique","Cover stretta /\nProfilo Europeo /\ncon override meccanico","smal schild /\nEuro profiel /\nmet Mechanical Override"]
["SI.SH.CSP","schmales Cover / \nEuro-PZ / \nmit Kartenausschnitt",null,"SI.SH.CSP","schmales Cover / \nEuro-PZ / \nmit Kartenausschnitt","narrow cover / \nEuro profile / \nwith card reader insert","plaque étroite / profil européen / pour lecture carte","Cover stretta /\nProfilo Europeo /\ncon inserto per lettura tessere","smal schild / \nEuro profiel / \nmet opbouw kaartlezer"]
["SI.SH.CSP.SO","schmales Cover / \nScandinavian Oval / \nmit Kartenausschnitt",null,"SI.SH.CSP.SO","schmales Cover / \nScandinavian Oval / \nmit Kartenausschnitt","narrow cover / \nScandinavian Oval / \nwith card reader insert","plaque étroite / ovale scandinave / pour lecture carte","Cover stretta /\nOvale Scandinavo /\ncon inserto per lettura tessere","smal schild / \nScandinavian Oval / \nmet opbouw kaartlezer"]
["SI.SH.CSP.SO.105","schmales Cover / \nScandinavian Oval / \nmit Kartenausschnitt / \nmit Mechanical Override",null,"SI.SH.CSP.SO.105","schmales Cover / \nScandinavian Oval / \nmit Kartenausschnitt / \nmit Mechanical Override","narrow cover / \nScandinavian Oval / \nwith card reader insert / \nwith mechanical override","plaque étroite / ovale scandinave / pour lecture carte / avec verrouillage mécanique","Cover stretta /\nOvale Scandinavo /\ncon inserto per lettura tessere /\ncon override meccanico","smal schild / \nScandinavian Oval / \nmet opbouw kaartlezer / \nmet mechanical override"]
["SI.SH.CSP.SR","schmales Cover / \nSwiss Round / \nmit Kartenausschnitt",null,"SI.SH.CSP.SR","schmales Cover / \nSwiss Round / \nmit Kartenausschnitt","narrow cover / \nSwiss Round / \nwith card reader insert","plaque étroite / suisse rond / pour lecture carte","Cover stretta /\nTondo Svizzero /\ncon inserto per lettura carte","smal schild / \nSwiss Round / \nmet opbouw kaartlezer"]
["SI.SH.CSP.SR.A78","schmales Cover / \nSwiss Round (Außenseite) /\nmit Kartenausschnitt /\nmit Mechanical Override",null,"SI.SH.CSP.SR.A78","schmales Cover / \nSwiss Round (Außenseite) /\nmit Kartenausschnitt /\nmit Mechanical Override","narrow cover / \nSwiss Round / \nwith card reader insert / \nwith mechanical override (outside)","plaque étroite / suisse rond / pour lecture carte / avec  verrouillage mécanique (extérieur)","Cover stretta /\nTondo Svizzero /\ncon inserto per lettura carte /\ncon override meccanico ( lato esterno )","smal schild / \nSwiss Round / \nmet opbouw kaartlezer / \nmet mechanical override (buitenzijde)"]
["SI.SH.CSP.X","schmales Cover / \nEuro-PZ / \nmit Kartenausschnitt / \nmit Mechanical Override",null,"SI.SH.CSP.X","schmales Cover / \nEuro-PZ / \nmit Kartenausschnitt / \nmit Mechanical Override","narrow cover / \nEuro profile / \nwith card reader insert / \nwith mechanical override","plaque étroite / profil européen / pour lecture carte / avec verrouillage mécanique","Cover stretta / \nProfilo Europeo /\ncon inserto per lettura tessere /\ncon override meccanico","smal schild / \nEuro profiel / \nmet opbouw kaartlezer / \nmet mechanical override"]
["SI.SH2.CBP","breites Cover / \nEuro-PZ / \nmit Kartenausschnitt (reichweitenoptimiert)",null,"SI.SH2.CBP","breites Cover / \nEuro-PZ / \nmit Kartenausschnitt (reichweitenoptimiert)","wide cover / \nEuro profile / \nwith card reader insert (Improved card reading distance)","plaque large /  profil européen / pour lecture carte (lecture optimisée)","Cover larga /\nProfilo Europeo /\ncon inserto per lettura tessere ( distanza di lettura estesa )","breed schild / \nEuro profiel / \nmet opbouw kaartlezer (verbeterde lees afstand)"]
["SI.SH2.CBP.SO","breites Cover / \nScandinavian Oval / \nmit Kartenausschnitt (reichweitenoptimiert)",null,"SI.SH2.CBP.SO","breites Cover / \nScandinavian Oval / \nmit Kartenausschnitt (reichweitenoptimiert)","wide cover / \nScandinavian Oval / \nwith card reader insert (Improved card reading distance)","plaque large / ovale scandinave / pour lecture carte (lecture optimisée)","Cover larga /\nOvale Scandinavo /\ncon inserto per lettura tessere ( distanza di lettura estesa )","breed schild / \nScandinavian Oval / \nmet opbouw kaartlezer (verbeterde lees afstand)"]
["SI.SH2.CBP.SO.105","breites Cover / \nScandinavian Oval / \nmit Kartenausschnitt (reichweitenoptimiert) / \nmit Mechanical Override",null,"SI.SH2.CBP.SO.105","breites Cover / \nScandinavian Oval / \nmit Kartenausschnitt (reichweitenoptimiert) / \nmit Mechanical Override","wide cover / \nScandinavian Oval / \nwith card reader insert (Improved card reading distance) / \nwith mechanical override","plaque large / ovale scandinave / pour lecture carte (lecture optimisée)  avec verrouillage mécanique","Cover larga /\nOvale Scandinavo /\ncon inserto per lettura tessere ( distanza di lettura estesa ) /\ncon override meccanico","breed schild / \nScandinavian Oval / \nmet opbouw kaartlezer (verbeterde lees afstand) / \nmet mechanical override"]
["SI.SH2.CBP.SR","breites Cover / \nSwiss Round / \nmit Kartenausschnitt (reichweitenoptimiert)",null,"SI.SH2.CBP.SR","breites Cover / \nSwiss Round / \nmit Kartenausschnitt (reichweitenoptimiert)","wide cover / \nSwiss Round / \nwith card reader insert (Improved card reading distance)","plaque large / suisse rond / pour lecture carte (lecture optimisée)","Cover larga /\nTondo Svizzero /\ncon inserto per lettura tessere ( distanza di lettura estesa ) /\ncon override meccanico","breed schild / \nSwiss Round / \nmet opbouw kaartlezer (verbeterde lees afstand)"]
["SI.SH2.CBP.SR.A78","breites Cover / \nSwiss Round (Außenseite) /\nmit Kartenausschnitt (reichweitenoptimiert) /\nmit Mechanical Override",null,"SI.SH2.CBP.SR.A78","breites Cover / \nSwiss Round (Außenseite) /\nmit Kartenausschnitt (reichweitenoptimiert) /\nmit Mechanical Override","wide cover / \nSwiss Round (outside) / \nwith card reader insert ( improved card reading distance) / \nwith mechanical override","plaque large / suisse rond (extérieur) avec verouillage mécanique","Cover larga /\nTondo Svizzero ( esterno ) /\ncon inserto per lettura tessere ( distanza di lettura estesa ) /\ncon override meccanico","breed schild / \nSwiss Round (buitenzijde) / \nmet opbouw kaartlezer (verbeterde lees afstand) / \nmet mechanical override"]
["SI.SH2.CBP.X","breites Cover / \nEuro-PZ / \nmit Kartenausschnitt (reichweitenoptimiert) / \nmit Mechanical Override",null,"SI.SH2.CBP.X","breites Cover / \nEuro-PZ / \nmit Kartenausschnitt (reichweitenoptimiert) / \nmit Mechanical Override","wide cover / \nEuro profile / \nwith card reader insert (Improved card reading distance) / \nwith mechanical override ","plaque large / profil européen / pour lecture carte (lecture optimisée)","Cover larga /\nProfilo Europeo /\ncon inserto per lettura tessere ( distanza di lettura estesa ) /\ncon override meccanico","breed schild / \nEuro profiel / \nmet opbouw kaartlezer (verbeterde lees afstand) / \nmet mechanical override "]
["SI.SH2.CSP","schmales Cover / \nEuro-PZ / \nmit Kartenausschnitt (reichweitenoptimiert)",null,"SI.SH2.CSP","schmales Cover / \nEuro-PZ / \nmit Kartenausschnitt (reichweitenoptimiert)","narrow cover / \nEuro profile / \nwith card reader insert (Improved card reading distance)","plaque étroite / profil européen / pour lecture carte (lecture optimisée)","Cover stretta /\nProfilo Europeo /\ncon inserto per lettura di tessere ( distanza di lettura estesa )","smal schild / \nEuro profiel / \nmet opbouw kaartlezer (verbeterde lees afstand)"]
["SI.SH2.CSP.SO","schmales Cover / \nScandinavian Oval / \nmit Kartenausschnitt (reichweitenoptimiert)",null,"SI.SH2.CSP.SO","schmales Cover / \nScandinavian Oval / \nmit Kartenausschnitt (reichweitenoptimiert)","narrow cover / \nScandinavian Oval / \nwith card reader insert (Improved card reading distance)","plaque étroite / ovale scandinave / pour lecture carte (lecture optimisée)","Cover stretta /\nOvale Scandinavo /\ncon inserto per lettura di tessere ( distanza di lettura estesa )","smal schild / \nScandinavian Oval / \nmet opbouw kaartlezer (verbeterde lees afstand)"]
["SI.SH2.CSP.SO.105","schmales Cover / \nScandinavian Oval / \nmit Kartenausschnitt (reichweitenoptimiert) / \nmit Mechanical Override",null,"SI.SH2.CSP.SO.105","schmales Cover / \nScandinavian Oval / \nmit Kartenausschnitt (reichweitenoptimiert) / \nmit Mechanical Override","narrow cover / \nScandinavian Oval / \nwith card reader insert (Improved card reading distance) / \nwith mechanical override ","plaque étroite / ovale scandinave / pour lecture carte (lecture optimisée) avec verrouillage mécanique","Cover stretta /\nOvale Scandinavo /\ncon inserto per lettura tessere ( distanza di lettura estesa ) /\ncon override meccanico","smal schild / \nScandinavian Oval / \nmet opbouw kaartlezer (verbeterde lees afstand) / \nmet mechanical override "]
["SI.SH2.CSP.SR","schmales Cover / \nSwiss Round / \nmit Kartenausschnitt (reichweitenoptimiert) ",null,"SI.SH2.CSP.SR","schmales Cover / \nSwiss Round / \nmit Kartenausschnitt (reichweitenoptimiert) ","narrow cover / \nSwiss Round / \nwith card reader insert (Improved card reading distance)","plaque étroite / suisse rond / pour lecture carte (lecture optimisée)","Cover stretta /\nTondo Svizzero /\ncon inserto per lettura tessere ( distanza di lettura estesa )","smal schild / \nSwiss Round / \nmet opbouw kaartlezer (verbeterde lees afstand)"]
["SI.SH2.CSP.SR.A78","schmales Cover / \nSwiss Round (Außenseite) /\nmit Kartenausschnitt (reichweitenoptimiert)  /\nmit Mechanical Override",null,"SI.SH2.CSP.SR.A78","schmales Cover / \nSwiss Round (Außenseite) /\nmit Kartenausschnitt (reichweitenoptimiert)  /\nmit Mechanical Override","narrow cover / \nSwiss Round (outside) / \nwith card reader insert (improved card reading distance) / \nwith mechanical override","plaque étroite / suisse rond (extérieur) pour lecture carte (lecture optimisée) avec verrouillage mécanique","Cover stretta /\nTondo Svizzero ( lato esterno ) /\ncon inserto per lettura tessere ( distanza di lettura estesa ) /\ncon override meccanico","smal schild / \nSwiss Round (buitenzijde) / \nmet opbouw kaartlezer (verbeterde lees afstand) / \nmet mechanical override"]
["SI.SH2.CSP.X","schmales Cover / \nEuro-PZ / \nmit Kartenausschnitt (reichweitenoptimiert) / \nmit Mechanical Override",null,"SI.SH2.CSP.X","schmales Cover / \nEuro-PZ / \nmit Kartenausschnitt (reichweitenoptimiert) / \nmit Mechanical Override","narrow cover / \nEuro profile / \nwith card reader insert (Improved card reading distance) / \nwith mechanical override","plaque étroite / profil européen / pour lecture carte (lecture optimisée) avec verrouillage mécanique","Cover stretta /\nProfilo Europeo /\ncon inserto per lettura tessere ( distanza di lettura estesa ) /\ncon override meccanico","smal schild / \nEuro profiel / \nmet opbouw kaartlezer (verbeterde lees afstand) / \nmet mechanical override"]
[null,"XXX"]

{"sheet":"Bilder für Rückwärtssuche","index":14,"n_rows":40,"n_cols":1,"rows_kept":40,"cut":false,"hidden":true,"merged":[]}
["Artikelnummer"]
["SI.SH.CB"]
["SI.SH.CB.SO"]
["SI.SH.CB.SO.105"]
["SI.SH.CB.SR"]
["SI.SH.CB.SR.A78"]
["SI.SH.CB.SR.I78"]
["SI.SH.CB.X"]
["SI.SH.CBP"]
["SI.SH.CBP.SO"]
["SI.SH.CBP.SO.105"]
["SI.SH.CBP.SR"]
["SI.SH.CBP.SR.A78"]
["SI.SH.CBP.X"]
["SI.SH.CS"]
["SI.SH.CS.SO"]
["SI.SH.CS.SO.105"]
["SI.SH.CS.SR"]
["SI.SH.CS.SR.A78"]
["SI.SH.CS.SR.I78"]
["SI.SH.CS.X"]
["SI.SH.CSP"]
["SI.SH.CSP.SO"]
["SI.SH.CSP.SO.105"]
["SI.SH.CSP.SR"]
["SI.SH.CSP.SR.A78"]
["SI.SH.CSP.X"]
["SI.SH2.CBP"]
["SI.SH2.CBP.SO"]
["SI.SH2.CBP.SO.105"]
["SI.SH2.CBP.SR"]
["SI.SH2.CBP.SR.A78"]
["SI.SH2.CBP.X"]
["SI.SH2.CSP"]
["SI.SH2.CSP.SO"]
["SI.SH2.CSP.SO.105"]
["SI.SH2.CSP.SR"]
["SI.SH2.CSP.SR.A78"]
["SI.SH2.CSP.X"]
["XXX"]

{"sheet":"Tabelle1","index":15,"n_rows":216,"n_cols":9,"rows_kept":216,"cut":false,"hidden":true,"merged":[]}
["SmartHandles","Zeile 18","Zeile 19","Zeile 20","Zeile 21","Zeile 22","Zeile 23","Zeile 24"]
["Profil",{"$f":"MID(SI_Programming_Gateways!$O18,1,6)","v":{"$error":"#N/A"}},{"$f":"MID(SI_Programming_Gateways!$O19,1,6)","v":{"$error":"#N/A"}},{"$f":"MID(SI_Programming_Gateways!$O20,1,6)","v":""},{"$f":"MID(SI_Programming_Gateways!$O30,1,6)","v":""},{"$f":"MID(SI_Programming_Gateways!$O31,1,6)","v":""},{"$f":"MID(SI_Programming_Gateways!$O32,1,6)","v":""},{"$f":"MID(SI_Programming_Gateways!$O33,1,6)","v":""}]
["Bef./Schildbreite",{"$f":"MID(SI_Programming_Gateways!$O18,10,1)","v":{"$error":"#N/A"}},{"$f":"MID(SI_Programming_Gateways!$O19,10,1)","v":{"$error":"#N/A"}},{"$f":"MID(SI_Programming_Gateways!$O20,10,1)","v":""},{"$f":"MID(SI_Programming_Gateways!$O30,10,1)","v":""},{"$f":"MID(SI_Programming_Gateways!$O31,10,1)","v":""},{"$f":"MID(SI_Programming_Gateways!$O32,10,1)","v":""},{"$f":"MID(SI_Programming_Gateways!$O33,10,1)","v":""}]
["Version",{"$f":"MID(SI_Programming_Gateways!$O18,13,1)","v":{"$error":"#N/A"}},{"$f":"MID(SI_Programming_Gateways!$O19,13,1)","v":{"$error":"#N/A"}},{"$f":"MID(SI_Programming_Gateways!$O20,13,1)","v":""},{"$f":"MID(SI_Programming_Gateways!$O30,13,1)","v":""},{"$f":"MID(SI_Programming_Gateways!$O31,13,1)","v":""},{"$f":"MID(SI_Programming_Gateways!$O32,13,1)","v":""},{"$f":"MID(SI_Programming_Gateways!$O33,13,1)","v":""}]
["online/VCN",{"$f":"MID(SI_Programming_Gateways!$O18,17,1)","v":{"$error":"#N/A"}},{"$f":"MID(SI_Programming_Gateways!$O19,17,1)","v":{"$error":"#N/A"}},{"$f":"MID(SI_Programming_Gateways!$O20,17,1)","v":""},{"$f":"MID(SI_Programming_Gateways!$O30,17,1)","v":""},{"$f":"MID(SI_Programming_Gateways!$O31,17,1)","v":""},{"$f":"MID(SI_Programming_Gateways!$O32,17,1)","v":""},{"$f":"MID(SI_Programming_Gateways!$O33,17,1)","v":""}]
[]
[]
["Prof/Bef./Version",{"$f":"VLOOKUP((B2&B3&B4&B5),$B$26:$C$154,2,FALSE)","v":{"$error":"#N/A"}},{"$error":"#N/A"},{"$error":"#N/A"},{"$error":"#N/A"},{"$error":"#N/A"},{"$error":"#N/A"},{"$error":"#N/A"}]
["M",{"$f":"IF(MID(SI_Programming_Gateways!$O18,7,1)=\"M\",VLOOKUP($A$9,$B$26:$C$154,2,FALSE),\"\")","v":{"$error":"#N/A"}},{"$f":"IF(MID(SI_Programming_Gateways!$O19,7,1)=\"M\",VLOOKUP($A$9,$B$26:$C$154,2,FALSE),\"\")","v":{"$error":"#N/A"}},{"$f":"IF(MID(SI_Programming_Gateways!$O20,7,1)=\"M\",VLOOKUP($A$9,$B$26:$C$154,2,FALSE),\"\")","v":""},{"$f":"IF(MID(SI_Programming_Gateways!$O30,7,1)=\"M\",VLOOKUP($A$9,$B$26:$C$154,2,FALSE),\"\")","v":""},{"$f":"IF(MID(SI_Programming_Gateways!$O31,7,1)=\"M\",VLOOKUP($A$9,$B$26:$C$154,2,FALSE),\"\")","v":""},{"$f":"IF(MID(SI_Programming_Gateways!$O32,7,1)=\"M\",VLOOKUP($A$9,$B$26:$C$154,2,FALSE),\"\")","v":""},{"$f":"IF(MID(SI_Programming_Gateways!$O33,7,1)=\"M\",VLOOKUP($A$9,$B$26:$C$154,2,FALSE),\"\")","v":""}]
["L",{"$f":"IF(MID(SI_Programming_Gateways!$O18,7,1)=\"L\",VLOOKUP($A$10,$B$26:$C$155,2,FALSE),\"\")","v":{"$error":"#N/A"}},{"$f":"IF(MID(SI_Programming_Gateways!$O19,7,1)=\"L\",VLOOKUP($A$10,$B$26:$C$155,2,FALSE),\"\")","v":{"$error":"#N/A"}},{"$f":"IF(MID(SI_Programming_Gateways!$O20,7,1)=\"L\",VLOOKUP($A$10,$B$26:$C$155,2,FALSE),\"\")","v":""},{"$f":"IF(MID(SI_Programming_Gateways!$O30,7,1)=\"L\",VLOOKUP($A$10,$B$26:$C$155,2,FALSE),\"\")","v":""},{"$f":"IF(MID(SI_Programming_Gateways!$O31,7,1)=\"L\",VLOOKUP($A$10,$B$26:$C$155,2,FALSE),\"\")","v":""},{"$f":"IF(MID(SI_Programming_Gateways!$O32,7,1)=\"L\",VLOOKUP($A$10,$B$26:$C$155,2,FALSE),\"\")","v":""},{"$f":"IF(MID(SI_Programming_Gateways!$O33,7,1)=\"L\",VLOOKUP($A$10,$B$26:$C$155,2,FALSE),\"\")","v":""}]
["F8",{"$f":"IF(MID(SI_Programming_Gateways!$O18,8,2)=\"F8\",VLOOKUP($A$11,$B$26:$C$154,2,FALSE),\"\")","v":{"$error":"#N/A"}},{"$f":"IF(MID(SI_Programming_Gateways!$O19,8,2)=\"F8\",VLOOKUP($A$11,$B$26:$C$154,2,FALSE),\"\")","v":{"$error":"#N/A"}},{"$f":"IF(MID(SI_Programming_Gateways!$O20,8,2)=\"F8\",VLOOKUP($A$11,$B$26:$C$154,2,FALSE),\"\")","v":""},{"$f":"IF(MID(SI_Programming_Gateways!$O30,8,2)=\"F8\",VLOOKUP($A$11,$B$26:$C$154,2,FALSE),\"\")","v":""},{"$f":"IF(MID(SI_Programming_Gateways!$O31,8,2)=\"F8\",VLOOKUP($A$11,$B$26:$C$154,2,FALSE),\"\")","v":""},{"$f":"IF(MID(SI_Programming_Gateways!$O32,8,2)=\"F8\",VLOOKUP($A$11,$B$26:$C$154,2,FALSE),\"\")","v":""},{"$f":"IF(MID(SI_Programming_Gateways!$O33,8,2)=\"F8\",VLOOKUP($A$11,$B$26:$C$154,2,FALSE),\"\")","v":""}]
[9,{"$f":"IF(MID(SI_Programming_Gateways!$O18,9,1)=\"9\",VLOOKUP($A$12,$B$26:$C$154,2,FALSE),\"\")","v":{"$error":"#N/A"}},{"$f":"IF(MID(SI_Programming_Gateways!$O19,9,1)=\"9\",VLOOKUP($A$12,$B$26:$C$154,2,FALSE),\"\")","v":{"$error":"#N/A"}},{"$f":"IF(MID(SI_Programming_Gateways!$O20,9,1)=\"9\",VLOOKUP($A$12,$B$26:$C$154,2,FALSE),\"\")","v":""},{"$f":"IF(MID(SI_Programming_Gateways!$O30,9,1)=\"9\",VLOOKUP($A$12,$B$26:$C$154,2,FALSE),\"\")","v":""},{"$f":"IF(MID(SI_Programming_Gateways!$O31,9,1)=\"9\",VLOOKUP($A$12,$B$26:$C$154,2,FALSE),\"\")","v":""},{"$f":"IF(MID(SI_Programming_Gateways!$O32,9,1)=\"9\",VLOOKUP($A$12,$B$26:$C$154,2,FALSE),\"\")","v":""},{"$f":"IF(MID(SI_Programming_Gateways!$O33,9,1)=\"9\",VLOOKUP($A$12,$B$26:$C$154,2,FALSE),\"\")","v":""}]
["Schild B-D-E-F-L",{"$f":"IF(OR(MID(SI_Programming_Gateways!$O18,10,1)=\"B\",MID(SI_Programming_Gateways!$O18,10,1)=\"D\",MID(SI_Programming_Gateways!$O18,10,1)=\"E\",MID(SI_Programming_Gateways!$O18,10,1)=\"F\",MID(SI_Programming_Gateways!$O18,10,1)=\"L\"),VLOOKUP($A$13,$B$26:$C$154,2,FALSE),\"\")","v":{"$error":"#N/A"}},{"$f":"IF(OR(MID(SI_Programming_Gateways!$O19,10,1)=\"B\",MID(SI_Programming_Gateways!$O19,10,1)=\"D\",MID(SI_Programming_Gateways!$O19,10,1)=\"E\",MID(SI_Programming_Gateways!$O19,10,1)=\"F\",MID(SI_Programming_Gateways!$O19,10,1)=\"L\"),VLOOKUP($A$13,$B$26:$C$154,2,FALSE),\"\")","v":{"$error":"#N/A"}},{"$f":"IF(OR(MID(SI_Programming_Gateways!$O20,10,1)=\"B\",MID(SI_Programming_Gateways!$O20,10,1)=\"D\",MID(SI_Programming_Gateways!$O20,10,1)=\"E\",MID(SI_Programming_Gateways!$O20,10,1)=\"F\",MID(SI_Programming_Gateways!$O20,10,1)=\"L\"),VLOOKUP($A$13,$B$26:$C$154,2,FALSE),\"\")","v":""},{"$f":"IF(OR(MID(SI_Programming_Gateways!$O30,10,1)=\"B\",MID(SI_Programming_Gateways!$O30,10,1)=\"D\",MID(SI_Programming_Gateways!$O30,10,1)=\"E\",MID(SI_Programming_Gateways!$O30,10,1)=\"F\",MID(SI_Programming_Gateways!$O30,10,1)=\"L\"),VLOOKUP($A$13,$B$26:$C$154,2,FALSE),\"\")","v":""},{"$f":"IF(OR(MID(SI_Programming_Gateways!$O31,10,1)=\"B\",MID(SI_Programming_Gateways!$O31,10,1)=\"D\",MID(SI_Programming_Gateways!$O31,10,1)=\"E\",MID(SI_Programming_Gateways!$O31,10,1)=\"F\",MID(SI_Programming_Gateways!$O31,10,1)=\"L\"),VLOOKUP($A$13,$B$26:$C$154,2,FALSE),\"\")","v":""},{"$f":"IF(OR(MID(SI_Programming_Gateways!$O32,10,1)=\"B\",MID(SI_Programming_Gateways!$O32,10,1)=\"D\",MID(SI_Programming_Gateways!$O32,10,1)=\"E\",MID(SI_Programming_Gateways!$O32,10,1)=\"F\",MID(SI_Programming_Gateways!$O32,10,1)=\"L\"),VLOOKUP($A$13,$B$26:$C$154,2,FALSE),\"\")","v":""},{"$f":"IF(OR(MID(SI_Programming_Gateways!$O33,10,1)=\"B\",MID(SI_Programming_Gateways!$O33,10,1)=\"D\",MID(SI_Programming_Gateways!$O33,10,1)=\"E\",MID(SI_Programming_Gateways!$O33,10,1)=\"F\",MID(SI_Programming_Gateways!$O33,10,1)=\"L\"),VLOOKUP($A$13,$B$26:$C$154,2,FALSE),\"\")","v":""}]
["Schild G-H-I-J",{"$f":"IF(OR(MID(SI_Programming_Gateways!$O18,10,1)=\"G\",MID(SI_Programming_Gateways!$O18,10,1)=\"H\",MID(SI_Programming_Gateways!$O18,10,1)=\"I\",MID(SI_Programming_Gateways!$O18,10,1)=\"J\"),VLOOKUP($A$14,$B$26:$C$154,2,FALSE),\"\")","v":{"$error":"#N/A"}},{"$f":"IF(OR(MID(SI_Programming_Gateways!$O19,10,1)=\"G\",MID(SI_Programming_Gateways!$O19,10,1)=\"H\",MID(SI_Programming_Gateways!$O19,10,1)=\"I\",MID(SI_Programming_Gateways!$O19,10,1)=\"J\"),VLOOKUP($A$14,$B$26:$C$154,2,FALSE),\"\")","v":{"$error":"#N/A"}},{"$f":"IF(OR(MID(SI_Programming_Gateways!$O20,10,1)=\"G\",MID(SI_Programming_Gateways!$O20,10,1)=\"H\",MID(SI_Programming_Gateways!$O20,10,1)=\"I\",MID(SI_Programming_Gateways!$O20,10,1)=\"J\"),VLOOKUP($A$14,$B$26:$C$154,2,FALSE),\"\")","v":""},{"$f":"IF(OR(MID(SI_Programming_Gateways!$O30,10,1)=\"G\",MID(SI_Programming_Gateways!$O30,10,1)=\"H\",MID(SI_Programming_Gateways!$O30,10,1)=\"I\",MID(SI_Programming_Gateways!$O30,10,1)=\"J\"),VLOOKUP($A$14,$B$26:$C$154,2,FALSE),\"\")","v":""},{"$f":"IF(OR(MID(SI_Programming_Gateways!$O31,10,1)=\"G\",MID(SI_Programming_Gateways!$O31,10,1)=\"H\",MID(SI_Programming_Gateways!$O31,10,1)=\"I\",MID(SI_Programming_Gateways!$O31,10,1)=\"J\"),VLOOKUP($A$14,$B$26:$C$154,2,FALSE),\"\")","v":""},{"$f":"IF(OR(MID(SI_Programming_Gateways!$O32,10,1)=\"G\",MID(SI_Programming_Gateways!$O32,10,1)=\"H\",MID(SI_Programming_Gateways!$O32,10,1)=\"I\",MID(SI_Programming_Gateways!$O32,10,1)=\"J\"),VLOOKUP($A$14,$B$26:$C$154,2,FALSE),\"\")","v":""},{"$f":"IF(OR(MID(SI_Programming_Gateways!$O33,10,1)=\"G\",MID(SI_Programming_Gateways!$O33,10,1)=\"H\",MID(SI_Programming_Gateways!$O33,10,1)=\"I\",MID(SI_Programming_Gateways!$O33,10,1)=\"J\"),VLOOKUP($A$14,$B$26:$C$154,2,FALSE),\"\")","v":""}]
["WP",{"$f":"IF(ISNUMBER(SEARCH(\"WP\",SI_Programming_Gateways!$O18)),VLOOKUP(Tabelle1!$A$15,Tabelle1!$B$26:$C$154,2,FALSE),\"\")","v":""},{"$f":"IF(ISNUMBER(SEARCH(\"WP\",SI_Programming_Gateways!$O19)),VLOOKUP(Tabelle1!$A$15,Tabelle1!$B$26:$C$154,2,FALSE),\"\")","v":""},{"$f":"IF(ISNUMBER(SEARCH(\"WP\",SI_Programming_Gateways!$O20)),VLOOKUP(Tabelle1!$A$15,Tabelle1!$B$26:$C$154,2,FALSE),\"\")","v":""},{"$f":"IF(ISNUMBER(SEARCH(\"WP\",SI_Programming_Gateways!$O30)),VLOOKUP(Tabelle1!$A$15,Tabelle1!$B$26:$C$154,2,FALSE),\"\")","v":""},{"$f":"IF(ISNUMBER(SEARCH(\"WP\",SI_Programming_Gateways!$O31)),VLOOKUP(Tabelle1!$A$15,Tabelle1!$B$26:$C$154,2,FALSE),\"\")","v":""},{"$f":"IF(ISNUMBER(SEARCH(\"WP\",SI_Programming_Gateways!$O32)),VLOOKUP(Tabelle1!$A$15,Tabelle1!$B$26:$C$154,2,FALSE),\"\")","v":""},{"$f":"IF(ISNUMBER(SEARCH(\"WP\",SI_Programming_Gateways!$O33)),VLOOKUP(Tabelle1!$A$15,Tabelle1!$B$26:$C$154,2,FALSE),\"\")","v":""}]
["Messing",{"$f":"IF(MID(SI_Programming_Gateways!$O18,16,1)=\"3\",VLOOKUP($A$16,$B$26:$C$155,2,FALSE),\"\")","v":{"$error":"#N/A"}},{"$f":"IF(MID(SI_Programming_Gateways!$O19,16,1)=\"3\",VLOOKUP($A$16,$B$26:$C$155,2,FALSE),\"\")","v":{"$error":"#N/A"}},{"$f":"IF(MID(SI_Programming_Gateways!$O20,16,1)=\"3\",VLOOKUP($A$16,$B$26:$C$155,2,FALSE),\"\")","v":""},{"$f":"IF(MID(SI_Programming_Gateways!$O30,16,1)=\"3\",VLOOKUP($A$16,$B$26:$C$155,2,FALSE),\"\")","v":""},{"$f":"IF(MID(SI_Programming_Gateways!$O31,16,1)=\"3\",VLOOKUP($A$16,$B$26:$C$155,2,FALSE),\"\")","v":""},{"$f":"IF(MID(SI_Programming_Gateways!$O32,16,1)=\"3\",VLOOKUP($A$16,$B$26:$C$155,2,FALSE),\"\")","v":""},{"$f":"IF(MID(SI_Programming_Gateways!$O33,16,1)=\"3\",VLOOKUP($A$16,$B$26:$C$155,2,FALSE),\"\")","v":""}]
["Summe",{"$f":"(IF(AND(B2<>\"\",B3<>\"\",B4<>\"\",B5<>\"\"),SUM(B8:B16),\"Preis auf Anfrage\"))","v":{"$error":"#N/A"}},{"$f":"SUM(C8:C16)","v":{"$error":"#N/A"}},{"$f":"(IF(AND(D2<>\"\",D3<>\"\",D4<>\"\",D5<>\"\"),SUM(D8:D16),\"Preis auf Anfrage\"))","v":"Preis auf Anfrage"},{"$f":"(IF(AND(E2<>\"\",E3<>\"\",E4<>\"\",E5<>\"\"),SUM(E8:E16),\"Preis auf Anfrage\"))","v":"Preis auf Anfrage"},{"$f":"(IF(AND(F2<>\"\",F3<>\"\",F4<>\"\",F5<>\"\"),SUM(F8:F16),\"Preis auf Anfrage\"))","v":"Preis auf Anfrage"},{"$f":"(IF(AND(G2<>\"\",G3<>\"\",G4<>\"\",G5<>\"\"),SUM(G8:G16),\"Preis auf Anfrage\"))","v":"Preis auf Anfrage"},{"$f":"(IF(AND(H2<>\"\",H3<>\"\",H4<>\"\",H5<>\"\"),SUM(H8:H16),\"Preis auf Anfrage\"))","v":"Preis auf Anfrage"}]
["Preis in Euro",{"$f":"IF(ISERROR(B8),\"Preis auf Anfrage\",B17)","v":"Preis auf Anfrage"},"Preis auf Anfrage","Preis auf Anfrage","Preis auf Anfrage","Preis auf Anfrage","Preis auf Anfrage","Preis auf Anfrage"]
["Preis in DKK (Umrechnungskurs 7,4205)",{"$f":"IF(ISERROR(B8),\"Preis auf Anfrage\",B17*$I$19)","v":"Preis auf Anfrage"},"Preis auf Anfrage","Preis auf Anfrage","Preis auf Anfrage","Preis auf Anfrage","Preis auf Anfrage","Preis auf Anfrage",7.4204999999999997]
["Preis in GBP (Umrechnungskurs 0,68)",{"$f":"IF(ISERROR(B$8),\"Preis auf Anfrage\",B$18*$I$20)","v":"Preis auf Anfrage"},{"$f":"IF(ISERROR(C$8),\"Preis auf Anfrage\",C$18*$I$20)","v":"Preis auf Anfrage"},"Preis auf Anfrage","Preis auf Anfrage","Preis auf Anfrage","Preis auf Anfrage","Preis auf Anfrage",0.67989750000000004]
[null,null,""]
[null,null,""]
[]
[]
[]
["Grundpreise SmartHandles nicht DM","SI.SHAA1A",565.79999999999995]
[null,"SI.SHAB1A",565.79999999999995]
[null,"SI.SHAC1A",521.4]
[null,"SI.SHAD1A",521.4]
[null,"SI.SHBC1A",565.79999999999995]
[null,"SI.SHBD1A",565.79999999999995]
[null,"SI.SHCE1A",543.6]
[null,"SI.SHCF1A",543.6]
[null,"SI.SHCG1A",543.6]
[null,"SI.SHCH1A",543.6]
[null,"SI.SHCI1A",543.6]
[null,"SI.SHCJ1A",543.6]
[null,"SI.SHCK1A",543.6]
[null,"SI.SHCL1A",543.6]
[null,"SI.SHEE1A",588]
[null,"SI.SHEF1A",588]
[null,"SI.SHEG1A",588]
[null,"SI.SHEH1A",588]
[null,"SI.SHEI1A",588]
[null,"SI.SHEJ1A",588]
[null,"SI.SHEK1A",588]
[null,"SI.SHEL1A",588]
[null,"SI.SHDE1A",543.6]
[null,"SI.SHDF1A",543.6]
[null,"SI.SHDG1A",543.6]
[null,"SI.SHDH1A",543.6]
[null,"SI.SHDI1A",543.6]
[null,"SI.SHDJ1A",543.6]
[null,"SI.SHDK1A",543.6]
[null,"SI.SHDL1A",543.6]
[null,"SI.SHAA13",565.79999999999995]
[null,"SI.SHAB13",565.79999999999995]
[null,"SI.SHAC13",521.4]
[null,"SI.SHAD13",521.4]
[null,"SI.SHBC13",565.79999999999995]
[null,"SI.SHBD13",565.79999999999995]
[null,"SI.SHCE13",543.6]
[null,"SI.SHCF13",543.6]
[null,"SI.SHCG13",543.6]
[null,"SI.SHCH13",543.6]
[null,"SI.SHCI13",543.6]
[null,"SI.SHCJ13",543.6]
[null,"SI.SHCK13",543.6]
[null,"SI.SHCL13",543.6]
[null,"SI.SHDE13",543.6]
[null,"SI.SHDF13",543.6]
[null,"SI.SHDG13",543.6]
[null,"SI.SHDH13",543.6]
[null,"SI.SHDI13",543.6]
[null,"SI.SHDJ13",543.6]
[null,"SI.SHDK13",543.6]
[null,"SI.SHDL13",543.6]
[null,"SI.SHEE13",588]
[null,"SI.SHEF13",588]
[null,"SI.SHEG13",588]
[null,"SI.SHEH13",588]
[null,"SI.SHEI13",588]
[null,"SI.SHEJ13",588]
[null,"SI.SHEK13",588]
[null,"SI.SHEL13",588]
[null,"SI.SHAA2A",866.7]
[null,"SI.SHAB2A",866.7]
[null,"SI.SHAC2A"]
[null,"SI.SHAD2A"]
[null,"SI.SHAA3A"]
[null,"SI.SHAB3A"]
[null,"SI.SHAC3A"]
[null,"SI.SHAD3A"]
[null,"SI.SHBC3A"]
[null,"SI.SHBD3A"]
[null,"SI.SHCE3A"]
[null,"SI.SHCF3A"]
[null,"SI.SHCG3A"]
[null,"SI.SHCH3A"]
[null,"SI.SHCI3A"]
[null,"SI.SHCJ3A"]
[null,"SI.SHCK3A"]
[null,"SI.SHCL3A"]
[null,"SI.SHEE3A"]
[null,"SI.SHEF3A"]
[null,"SI.SHEG3A"]
[null,"SI.SHEH3A"]
[null,"SI.SHEI3A"]
[null,"SI.SHEJ3A"]
[null,"SI.SHEK3A"]
[null,"SI.SHDE3A"]
[null,"SI.SHDF3A"]
[null,"SI.SHDG3A"]
[null,"SI.SHDH3A"]
[null,"SI.SHDI3A"]
[null,"SI.SHDJ3A"]
[null,"SI.SHDK3A"]
[null,"SI.SHDL3A"]
[null,"SI.SHAA4A"]
[null,"SI.SHAB4A"]
[null,"SI.SHAC4A"]
[null,"SI.SHAD4A"]
[null,"SI.SHBC4A"]
[null,"SI.SHBD4A"]
[null,"SI.SHCE4A"]
[null,"SI.SHCF4A"]
[null,"SI.SHCG4A"]
[null,"SI.SHCH4A"]
[null,"SI.SHCI4A"]
[null,"SI.SHCJ4A"]
[null,"SI.SHCK4A"]
[null,"SI.SHCL4A"]
[null,"SI.SHEE4A"]
[null,"SI.SHEF4A"]
[null,"SI.SHEG4A"]
[null,"SI.SHEH4A"]
[null,"SI.SHEI4A"]
[null,"SI.SHEJ4A"]
[null,"SI.SHEK4A"]
[null,"SI.SHDE4A"]
[null,"SI.SHDF4A"]
[null,"SI.SHDG4A"]
[null,"SI.SHDH4A"]
[null,"SI.SHDI4A"]
[null,"SI.SHDJ4A"]
[null,"SI.SHDK4A"]
[null,"SI.SHDL4A"]
[null,"M",33.799999999999997]
[null,"L",53.7]
[null,"F8",75.3]
[null,9,75.3]
[null,"Schild B-D-E-F-L",28.8]
[null,"Schild G-H-I-J",14.5]
[null,"WP",130.5]
[null,"Messing",272.10000000000002]
[]
[]
[]
[]
[]
[]
[]
[]
[]
[]
[]
[]
[]
[]
[]
[]
[]
[]
[]
[]
[]
[]
[]
[]
[]
[]
[]
[]
[]
[null,null,null,null,"SmartHandle G1"]
[]
[]
[]
[]
[]
[]
[]
[]
[]
[]
[]
[]
[]
[]
[]
[]
[]
[]
[]
[]
[]
[]
[]
[]
[]
[]
[]
[]
[]
[null,null,null,null,"Sonder"]
[null,null,null,null,"Sonder"]

{"sheet":"Hilfstabelle für Zus.fass.","index":16,"n_rows":55,"n_cols":15,"rows_kept":55,"cut":false,"hidden":true,"merged":[]}
["Hilftabelle für Zusammenfassung"]
[]
["Menge","Artikelnummer","Beschreibung",null,null,null,null,null,null,null,"Artikeltyp","Zeile",null,null,"prüfen ob keine Auswahl"]
[{"$f":"IF('Bestellhilfe - ordering guide'!A17<>\"\",'Bestellhilfe - ordering guide'!A17,\"\")","v":1},{"$f":"IF('Bestellhilfe - ordering guide'!O17<>\"\",'Bestellhilfe - ordering guide'!O17,\"\")","v":"SI-S2.E1.01.AA.1.M08.M.WO"},{"$f":"IF('Bestellhilfe - ordering guide'!AP17<>\"\",'Bestellhilfe - ordering guide'!AP17,\"\")","v":"SmartHandle AX (Smart Intego), (E0) - Skandinavisk Oval\n- uden låsecylinderåbning / stående montage, sølv / sort grå (1), (M) SmartCards / SmartTagsWireless Online"},null,null,null,null,null,null,{"$f":"IF(B4<>\"\",\"x\",\"\")","v":"x"},"SmartHandle",17,null,{"$f":"IF(AND(J4=\"x\",A4=\"\"),1,0)","v":0},{"$f":"IF(J4=\"x\",1,0)","v":1}]
[{"$f":"IF('Bestellhilfe - ordering guide'!A18<>\"\",'Bestellhilfe - ordering guide'!A18,\"\")","v":""},{"$f":"IF('Bestellhilfe - ordering guide'!O18<>\"\",'Bestellhilfe - ordering guide'!O18,\"\")","v":""},{"$f":"IF('Bestellhilfe - ordering guide'!AP18<>\"\",'Bestellhilfe - ordering guide'!AP18,\"\")","v":""},null,null,null,null,null,null,"","SmartHandle",18,null,{"$f":"IF(AND(J5=\"x\",A5=\"\"),1,0)","v":0},{"$f":"IF(J5=\"x\",1,0)","v":0}]
[{"$f":"IF('Bestellhilfe - ordering guide'!A19<>\"\",'Bestellhilfe - ordering guide'!A19,\"\")","v":""},{"$f":"IF('Bestellhilfe - ordering guide'!O19<>\"\",'Bestellhilfe - ordering guide'!O19,\"\")","v":""},{"$f":"IF('Bestellhilfe - ordering guide'!AP19<>\"\",'Bestellhilfe - ordering guide'!AP19,\"\")","v":""},null,null,null,null,null,null,"","SmartHandle",19,null,0,0]
[{"$f":"IF('Bestellhilfe - ordering guide'!A20<>\"\",'Bestellhilfe - ordering guide'!A20,\"\")","v":""},{"$f":"IF('Bestellhilfe - ordering guide'!O20<>\"\",'Bestellhilfe - ordering guide'!O20,\"\")","v":""},{"$f":"IF('Bestellhilfe - ordering guide'!AP20<>\"\",'Bestellhilfe - ordering guide'!AP20,\"\")","v":""},null,null,null,null,null,null,"","SmartHandle",20,null,0,0]
[{"$f":"IF('Bestellhilfe - ordering guide'!A21<>\"\",'Bestellhilfe - ordering guide'!A21,\"\")","v":""},{"$f":"IF('Bestellhilfe - ordering guide'!O21<>\"\",'Bestellhilfe - ordering guide'!O21,\"\")","v":""},{"$f":"IF('Bestellhilfe - ordering guide'!AP21<>\"\",'Bestellhilfe - ordering guide'!AP21,\"\")","v":""},null,null,null,null,null,null,"","SmartHandle",21,null,0,0]
[{"$f":"IF('Bestellhilfe - ordering guide'!A22<>\"\",'Bestellhilfe - ordering guide'!A22,\"\")","v":""},{"$f":"IF('Bestellhilfe - ordering guide'!O22<>\"\",'Bestellhilfe - ordering guide'!O22,\"\")","v":""},{"$f":"IF('Bestellhilfe - ordering guide'!AP22<>\"\",'Bestellhilfe - ordering guide'!AP22,\"\")","v":""},null,null,null,null,null,null,"","SmartHandle",22,null,0,0]
[{"$f":"IF('Bestellhilfe - ordering guide'!A23<>\"\",'Bestellhilfe - ordering guide'!A23,\"\")","v":""},{"$f":"IF('Bestellhilfe - ordering guide'!O23<>\"\",'Bestellhilfe - ordering guide'!O23,\"\")","v":""},{"$f":"IF('Bestellhilfe - ordering guide'!AP23<>\"\",'Bestellhilfe - ordering guide'!AP23,\"\")","v":""},null,null,null,null,null,null,"","SmartHandle",23,null,0,0]
[{"$f":"IF('Bestellhilfe - ordering guide'!A24<>\"\",'Bestellhilfe - ordering guide'!A24,\"\")","v":""},{"$f":"IF('Bestellhilfe - ordering guide'!O24<>\"\",'Bestellhilfe - ordering guide'!O24,\"\")","v":""},{"$f":"IF('Bestellhilfe - ordering guide'!AP24<>\"\",'Bestellhilfe - ordering guide'!AP24,\"\")","v":""},null,null,null,null,null,null,"","SmartHandle",24,null,0,0]
[{"$f":"IF(SI_Programming_Gateways!A26<>\"\",SI_Programming_Gateways!A26,\"\")","v":""},{"$f":"IF(SI_Programming_Gateways!O26<>\"\",SI_Programming_Gateways!O26,\"\")","v":""},{"$f":"IF(SI_Programming_Gateways!AB26<>\"\",SI_Programming_Gateways!AB26,\"\")","v":""},null,null,null,null,null,null,"","SmartHandle",25,null,0,0]
[{"$f":"IF(SI_Programming_Gateways!A27<>\"\",SI_Programming_Gateways!A27,\"\")","v":""},{"$f":"IF(SI_Programming_Gateways!O27<>\"\",SI_Programming_Gateways!O27,\"\")","v":""},{"$f":"IF(SI_Programming_Gateways!AB27<>\"\",SI_Programming_Gateways!AB27,\"\")","v":""},null,null,null,null,null,null,"","SmartHandle",26,null,0,0]
[{"$f":"IF(SI_Programming_Gateways!A28<>\"\",SI_Programming_Gateways!A28,\"\")","v":""},{"$f":"IF(SI_Programming_Gateways!O28<>\"\",SI_Programming_Gateways!O28,\"\")","v":""},{"$f":"IF(SI_Programming_Gateways!AB28<>\"\",SI_Programming_Gateways!AB28,\"\")","v":""},null,null,null,null,null,null,"","SmartHandle",27,null,0,0]
[{"$f":"IF(SI_Programming_Gateways!A29<>\"\",SI_Programming_Gateways!A29,\"\")","v":""},{"$f":"IF(SI_Programming_Gateways!O29<>\"\",SI_Programming_Gateways!O29,\"\")","v":""},{"$f":"IF(SI_Programming_Gateways!AB29<>\"\",SI_Programming_Gateways!AB29,\"\")","v":""},null,null,null,null,null,null,"","SmartHandle",28,null,0,0]
[{"$f":"IF(SI_Programming_Gateways!A30<>\"\",SI_Programming_Gateways!A30,\"\")","v":""},{"$f":"IF(SI_Programming_Gateways!O30<>\"\",SI_Programming_Gateways!O30,\"\")","v":""},{"$f":"IF(SI_Programming_Gateways!AB30<>\"\",SI_Programming_Gateways!AB30,\"\")","v":""},null,null,null,null,null,null,"","SmartHandle",29,null,0,0]
[{"$f":"IF(SI_Programming_Gateways!A31<>\"\",SI_Programming_Gateways!A31,\"\")","v":""},{"$f":"IF(SI_Programming_Gateways!O31<>\"\",SI_Programming_Gateways!O31,\"\")","v":""},{"$f":"IF(SI_Programming_Gateways!AB31<>\"\",SI_Programming_Gateways!AB31,\"\")","v":""},null,null,null,null,null,null,"","SmartHandle",30,null,0,0]
[{"$f":"IF(SI_Programming_Gateways!A32<>\"\",SI_Programming_Gateways!A32,\"\")","v":""},{"$f":"IF(SI_Programming_Gateways!O32<>\"\",SI_Programming_Gateways!O32,\"\")","v":""},{"$f":"IF(SI_Programming_Gateways!AB32<>\"\",SI_Programming_Gateways!AB32,\"\")","v":""},null,null,null,null,null,null,"","SmartHandle",31,null,0,0]
[{"$f":"IF(SI_Programming_Gateways!A33<>\"\",SI_Programming_Gateways!A33,\"\")","v":""},{"$f":"IF(SI_Programming_Gateways!O33<>\"\",SI_Programming_Gateways!O33,\"\")","v":""},{"$f":"IF(SI_Programming_Gateways!AB33<>\"\",SI_Programming_Gateways!AB33,\"\")","v":""},null,null,null,null,null,null,"","SmartHandle",32,null,0,0]
[{"$f":"IF(SI_Programming_Gateways!A34<>\"\",SI_Programming_Gateways!A34,\"\")","v":""},{"$f":"IF(SI_Programming_Gateways!O34<>\"\",SI_Programming_Gateways!O34,\"\")","v":""},{"$f":"IF(SI_Programming_Gateways!AB34<>\"\",SI_Programming_Gateways!AB34,\"\")","v":""},null,null,null,null,null,null,"","SmartHandle",33,null,0,0]
[{"$f":"IF(SI_Programming_Gateways!A38<>\"\",SI_Programming_Gateways!A38,\"\")","v":""},{"$f":"IF(SI_Programming_Gateways!D38<>\"\",SI_Programming_Gateways!D38,\"\")","v":""},{"$f":"IF(SI_Programming_Gateways!B38<>\"\",SI_Programming_Gateways!B38,\"\")","v":""},null,null,null,null,null,null,"","Programmierung",null,null,0,0]
[{"$f":"IF(SI_Programming_Gateways!A39<>\"\",SI_Programming_Gateways!A39,\"\")","v":""},{"$f":"IF(SI_Programming_Gateways!D39<>\"\",SI_Programming_Gateways!D39,\"\")","v":""},{"$f":"IF(SI_Programming_Gateways!B39<>\"\",SI_Programming_Gateways!B39,\"\")","v":""},null,null,null,null,null,null,"","Programmierung",null,null,0,0]
[{"$f":"IF(SI_Programming_Gateways!H38<>\"\",SI_Programming_Gateways!H38,\"\")","v":""},{"$f":"IF(SI_Programming_Gateways!O38<>\"\",SI_Programming_Gateways!O38,\"\")","v":"SI.N.IO"},{"$f":"IF(SI_Programming_Gateways!I38<>\"\",SI_Programming_Gateways!I38,\"\")","v":""},null,null,null,null,null,null,"x","Gateway Nodes",null,null,1,1]
[{"$f":"IF(SI_Programming_Gateways!H39<>\"\",SI_Programming_Gateways!H39,\"\")","v":""},{"$f":"IF(SI_Programming_Gateways!O39<>\"\",SI_Programming_Gateways!O39,\"\")","v":"SI.N.IO"},{"$f":"IF(SI_Programming_Gateways!I39<>\"\",SI_Programming_Gateways!I39,\"\")","v":""},null,null,null,null,null,null,"x","Gateway Nodes",null,null,1,1]
[{"$f":"IF(SI_Programming_Gateways!H40<>\"\",SI_Programming_Gateways!H40,\"\")","v":""},{"$f":"IF(SI_Programming_Gateways!O40<>\"\",SI_Programming_Gateways!O40,\"\")","v":"SI.N.IO"},{"$f":"IF(SI_Programming_Gateways!I40<>\"\",SI_Programming_Gateways!I40,\"\")","v":""},null,null,null,null,null,null,"x","Gateway Nodes",null,null,1,1]
[{"$f":"IF(SI_Programming_Gateways!H41<>\"\",SI_Programming_Gateways!H41,\"\")","v":""},{"$f":"IF(SI_Programming_Gateways!O41<>\"\",SI_Programming_Gateways!O41,\"\")","v":"SI.N.IO"},{"$f":"IF(SI_Programming_Gateways!I41<>\"\",SI_Programming_Gateways!I41,\"\")","v":""},null,null,null,null,null,null,"x","Gateway Nodes",null,null,1,1]
[{"$f":"IF(SI_Zylinder!A20<>\"\",SI_Zylinder!A20,\"\")","v":""},{"$f":"IF(SI_Zylinder!I20<>\"\",SI_Zylinder!I20,\"\")","v":{"$error":"#N/A"}},{"$f":"IF(SI_Zylinder!U20<>\"\",SI_Zylinder!U20,\"\")","v":{"$error":"#N/A"}},null,null,null,null,null,null,{"$error":"#N/A"},"Zylinder",null,null,{"$error":"#N/A"},{"$error":"#N/A"}]
[{"$f":"IF(SI_Zylinder!A21<>\"\",SI_Zylinder!A21,\"\")","v":""},{"$f":"IF(SI_Zylinder!I21<>\"\",SI_Zylinder!I21,\"\")","v":{"$error":"#N/A"}},{"$f":"IF(SI_Zylinder!U21<>\"\",SI_Zylinder!U21,\"\")","v":{"$error":"#N/A"}},null,null,null,null,null,null,{"$error":"#N/A"},"Zylinder",null,null,{"$error":"#N/A"},{"$error":"#N/A"}]
[{"$f":"IF(SI_Zylinder!A22<>\"\",SI_Zylinder!A22,\"\")","v":""},{"$f":"IF(SI_Zylinder!I22<>\"\",SI_Zylinder!I22,\"\")","v":{"$error":"#N/A"}},{"$f":"IF(SI_Zylinder!U22<>\"\",SI_Zylinder!U22,\"\")","v":{"$error":"#N/A"}},null,null,null,null,null,null,{"$error":"#N/A"},"Zylinder",null,null,{"$error":"#N/A"},{"$error":"#N/A"}]
[{"$f":"IF(SI_Zylinder!A23<>\"\",SI_Zylinder!A23,\"\")","v":""},{"$f":"IF(SI_Zylinder!I23<>\"\",SI_Zylinder!I23,\"\")","v":{"$error":"#N/A"}},{"$f":"IF(SI_Zylinder!U23<>\"\",SI_Zylinder!U23,\"\")","v":{"$error":"#N/A"}},null,null,null,null,null,null,{"$error":"#N/A"},"Zylinder",null,null,{"$error":"#N/A"},{"$error":"#N/A"}]
[{"$f":"IF(SI_Zylinder!A24<>\"\",SI_Zylinder!A24,\"\")","v":""},{"$f":"IF(SI_Zylinder!I24<>\"\",SI_Zylinder!I24,\"\")","v":{"$error":"#N/A"}},{"$f":"IF(SI_Zylinder!U24<>\"\",SI_Zylinder!U24,\"\")","v":{"$error":"#N/A"}},null,null,null,null,null,null,{"$error":"#N/A"},"Zylinder",null,null,{"$error":"#N/A"},{"$error":"#N/A"}]
[{"$f":"IF(SI_Zylinder!A25<>\"\",SI_Zylinder!A25,\"\")","v":""},{"$f":"IF(SI_Zylinder!I25<>\"\",SI_Zylinder!I25,\"\")","v":{"$error":"#N/A"}},{"$f":"IF(SI_Zylinder!U25<>\"\",SI_Zylinder!U25,\"\")","v":{"$error":"#N/A"}},null,null,null,null,null,null,{"$error":"#N/A"},"Zylinder",null,null,{"$error":"#N/A"},{"$error":"#N/A"}]
[{"$f":"IF(SI_Zylinder!A26<>\"\",SI_Zylinder!A26,\"\")","v":""},{"$f":"IF(SI_Zylinder!I26<>\"\",SI_Zylinder!I26,\"\")","v":{"$error":"#N/A"}},{"$f":"IF(SI_Zylinder!U26<>\"\",SI_Zylinder!U26,\"\")","v":{"$error":"#N/A"}},null,null,null,null,null,null,{"$error":"#N/A"},"Zylinder",null,null,{"$error":"#N/A"},{"$error":"#N/A"}]
[{"$f":"IF('SmartHandle Cover - order tool'!A9<>\"\",'SmartHandle Cover - order tool'!A9,\"\")","v":""},{"$f":"IF('SmartHandle Cover - order tool'!H9<>\"\",'SmartHandle Cover - order tool'!H9,\"\")","v":""},{"$f":"IF('SmartHandle Cover - order tool'!R9<>\"\",'SmartHandle Cover - order tool'!R9,\"\")","v":{"$error":"#N/A"}},null,null,null,null,null,null,"","SmartHandle Cover",null,null,0,0]
[{"$f":"IF('SmartHandle Cover - order tool'!A10<>\"\",'SmartHandle Cover - order tool'!A10,\"\")","v":""},{"$f":"IF('SmartHandle Cover - order tool'!H10<>\"\",'SmartHandle Cover - order tool'!H10,\"\")","v":""},{"$f":"IF('SmartHandle Cover - order tool'!Q10<>\"\",'SmartHandle Cover - order tool'!Q10,\"\")","v":""},null,null,null,null,null,null,"","SmartHandle Cover",null,null,0,0]
[{"$f":"IF('SmartHandle Cover - order tool'!A11<>\"\",'SmartHandle Cover - order tool'!A11,\"\")","v":""},{"$f":"IF('SmartHandle Cover - order tool'!H11<>\"\",'SmartHandle Cover - order tool'!H11,\"\")","v":""},{"$f":"IF('SmartHandle Cover - order tool'!Q11<>\"\",'SmartHandle Cover - order tool'!Q11,\"\")","v":""},null,null,null,null,null,null,"","SmartHandle Cover",null,null,0,0]
[{"$f":"IF('SmartHandle Cover - order tool'!A12<>\"\",'SmartHandle Cover - order tool'!A12,\"\")","v":""},{"$f":"IF('SmartHandle Cover - order tool'!H12<>\"\",'SmartHandle Cover - order tool'!H12,\"\")","v":""},{"$f":"IF('SmartHandle Cover - order tool'!Q12<>\"\",'SmartHandle Cover - order tool'!Q12,\"\")","v":""},null,null,null,null,null,null,"","SmartHandle Cover",null,null,0,0]
[{"$f":"IF('SmartHandle Cover - order tool'!A13<>\"\",'SmartHandle Cover - order tool'!A13,\"\")","v":""},{"$f":"IF('SmartHandle Cover - order tool'!H13<>\"\",'SmartHandle Cover - order tool'!H13,\"\")","v":""},{"$f":"IF('SmartHandle Cover - order tool'!Q13<>\"\",'SmartHandle Cover - order tool'!Q13,\"\")","v":""},null,null,null,null,null,null,"","SmartHandle Cover",null,null,0,0]
[{"$f":"IF('SmartHandle Cover - order tool'!A14<>\"\",'SmartHandle Cover - order tool'!A14,\"\")","v":""},{"$f":"IF('SmartHandle Cover - order tool'!H14<>\"\",'SmartHandle Cover - order tool'!H14,\"\")","v":""},{"$f":"IF('SmartHandle Cover - order tool'!Q14<>\"\",'SmartHandle Cover - order tool'!Q14,\"\")","v":""},null,null,null,null,null,null,"","SmartHandle Cover",null,null,0,0]
[{"$f":"IF('ID medium'!A8<>\"\",'ID medium'!A8,\"\")","v":""},{"$f":"IF('ID medium'!B8<>\"\",'ID medium'!B8,\"\")","v":""},{"$f":"IF('ID medium'!K8<>\"\",'ID medium'!K8,\"\")","v":""},null,null,null,null,null,null,"","ID Medium SI.Pincode",null,null,0,0]
[{"$f":"IF('ID medium'!A15<>\"\",'ID medium'!A15,\"\")","v":""},{"$f":"IF('ID medium'!E15<>\"\",'ID medium'!E15,\"\")","v":""},{"$f":"IF('ID medium'!K15<>\"\",'ID medium'!K15,\"\")","v":""},null,null,null,null,null,null,"","ID Medium Karten",null,null,0,0]
[{"$f":"IF('ID medium'!A16<>\"\",'ID medium'!A16,\"\")","v":""},{"$f":"IF('ID medium'!E16<>\"\",'ID medium'!E16,\"\")","v":""},{"$f":"IF('ID medium'!K16<>\"\",'ID medium'!K16,\"\")","v":""},null,null,null,null,null,null,"","ID Medium Karten",null,null,0,0]
[{"$f":"IF('ID medium'!A17<>\"\",'ID medium'!A17,\"\")","v":""},{"$f":"IF('ID medium'!E17<>\"\",'ID medium'!E17,\"\")","v":""},{"$f":"IF('ID medium'!K17<>\"\",'ID medium'!K17,\"\")","v":""},null,null,null,null,null,null,"","ID Medium Karten",null,null,0,0]
[{"$f":"IF('ID medium'!A18<>\"\",'ID medium'!A18,\"\")","v":""},{"$f":"IF('ID medium'!E18<>\"\",'ID medium'!E18,\"\")","v":""},{"$f":"IF('ID medium'!K18<>\"\",'ID medium'!K18,\"\")","v":""},null,null,null,null,null,null,"","ID Medium Karten",null,null,0,0]
[{"$f":"IF('ID medium'!A19<>\"\",'ID medium'!A19,\"\")","v":""},{"$f":"IF('ID medium'!E19<>\"\",'ID medium'!E19,\"\")","v":""},{"$f":"IF('ID medium'!K19<>\"\",'ID medium'!K19,\"\")","v":""},null,null,null,null,null,null,"","ID Medium Karten",null,null,0,0]
[{"$f":"IF('ID medium'!A26<>\"\",'ID medium'!A26,\"\")","v":""},{"$f":"IF('ID medium'!E26<>\"\",'ID medium'!E26,\"\")","v":""},{"$f":"IF('ID medium'!K26<>\"\",'ID medium'!K26,\"\")","v":""},null,null,null,null,null,null,"","ID Medium Tags",null,null,0,0]
[{"$f":"IF('ID medium'!A27<>\"\",'ID medium'!A27,\"\")","v":""},{"$f":"IF('ID medium'!E27<>\"\",'ID medium'!E27,\"\")","v":""},{"$f":"IF('ID medium'!K27<>\"\",'ID medium'!K27,\"\")","v":""},null,null,null,null,null,null,"","ID Medium Tags",null,null,0,0]
[{"$f":"IF('ID medium'!A28<>\"\",'ID medium'!A28,\"\")","v":""},{"$f":"IF('ID medium'!E28<>\"\",'ID medium'!E28,\"\")","v":""},{"$f":"IF('ID medium'!K28<>\"\",'ID medium'!K28,\"\")","v":""},null,null,null,null,null,null,"","ID Medium Tags",null,null,0,0]
[{"$f":"IF('ID medium'!A29<>\"\",'ID medium'!A29,\"\")","v":""},{"$f":"IF('ID medium'!E29<>\"\",'ID medium'!E29,\"\")","v":""},{"$f":"IF('ID medium'!K29<>\"\",'ID medium'!K29,\"\")","v":""},null,null,null,null,null,null,"","ID Medium Tags",null,null,0,0]
[{"$f":"IF('ID medium'!A30<>\"\",'ID medium'!A30,\"\")","v":""},{"$f":"IF('ID medium'!E30<>\"\",'ID medium'!E30,\"\")","v":""},{"$f":"IF('ID medium'!K30<>\"\",'ID medium'!K30,\"\")","v":""},null,null,null,null,null,null,"","ID Medium Tags",null,null,0,0]
[{"$f":"IF(AND('Bestellhilfe - ordering guide'!A25<>\"\",'Bestellhilfe - ordering guide'!A27<>\"\"),'Bestellhilfe - ordering guide'!A25,\"\")","v":""},{"$f":"IF(AND('Bestellhilfe - ordering guide'!O25<>\"\",'Bestellhilfe - ordering guide'!A27<>\"\"),'Bestellhilfe - ordering guide'!O25,\"\")","v":""},{"$f":"IF(AND('Bestellhilfe - ordering guide'!AP25<>\"\",'Bestellhilfe - ordering guide'!A27<>\"\"),'Bestellhilfe - ordering guide'!AP25,\"\")","v":""},null,null,null,null,null,null,"","Fremddrücker",null,null,{"$f":"IF(AND(J51=\"x\",A51=\"\"),1,0)","v":0},{"$f":"IF(J51=\"x\",1,0)","v":0}]
[{"$f":"IF(AND('Bestellhilfe - ordering guide'!A26<>\"\",'Bestellhilfe - ordering guide'!A27<>\"\"),'Bestellhilfe - ordering guide'!A26,\"\")","v":""},{"$f":"IF(AND('Bestellhilfe - ordering guide'!O26<>\"\",'Bestellhilfe - ordering guide'!A27<>\"\"),'Bestellhilfe - ordering guide'!O26,\"\")","v":""},{"$f":"IF(AND('Bestellhilfe - ordering guide'!AP26<>\"\",'Bestellhilfe - ordering guide'!A27<>\"\"),'Bestellhilfe - ordering guide'!AP26,\"\")","v":""},null,null,null,null,null,null,"","Fremddrücker",null,null,0,0]
[]
[]
[null,null,null,null,null,null,null,null,null,null,null,null,"Summe",{"$f":"SUM(N4:N52)","v":{"$error":"#N/A"}},{"$f":"SUM(O4:O52)","v":{"$error":"#N/A"}}]

{"sheet":"ID medium","index":17,"n_rows":696,"n_cols":15,"rows_kept":696,"cut":false,"hidden":true,"merged":[]}
[{"$f":"H201","v":"noch zu übersetzen"},null,null,null,null,null,null,null,null,null,{"$f":"'Hauptseite - main page'!G3","v":"Dansk"}]
[null,null,null,null,null,null,null,null,null,null,{"$f":"'SmartHandle Cover - order tool'!AR89","v":"noch zu übersetzen"}]
[]
[]
[{"$f":"H202","v":"noch zu übersetzen"}]
[]
[{"$f":"SI_Programming_Gateways!A17","v":"Antal"},{"$f":"SI_Programming_Gateways!O37","v":"Varenummer"}]
[null,{"$f":"IF(A8<>\"\",M207,\"\")","v":""},null,null,null,null,null,null,null,null,{"$f":"IF(B8<>\"\",VLOOKUP(B8,$M$207:$N$227,2,FALSE),\"\")","v":""}]
[]
[]
[]
[{"$f":"H203","v":"SmartCards Mifare"}]
[]
[{"$f":"A7","v":"Antal"},"Classic / DesFire",{"$f":"H204","v":"noch zu übersetzen"},{"$f":"H205","v":"noch zu übersetzen"},{"$f":"B7","v":"Varenummer"},{"$f":"SI_Programming_Gateways!P17","v":"Korrekt varenummer?"},null,"Summe"]
[null,null,null,null,{"$f":"IF(F15=SI_Programming_Gateways!$B$215,D104&C15&\".\"&D15,\"\")","v":""},{"$f":"IF(AND(A15<>\"\",B15<>\"\",C15<>\"\",D15<>\"\"),SI_Programming_Gateways!$B$215,SI_Programming_Gateways!$A$215)","v":"Î"},{"$f":"IF(AND(H15>0,F15=SI_Programming_Gateways!$A$215),1,0)","v":0},{"$f":"SUM(L15:O15)","v":0},null,null,{"$f":"IF(F15<>SI_Programming_Gateways!$A$215,E104&\", \"&C15&\" \"&$H$204&\", \"&D15&\" \"&$H$205,\"\")","v":""},{"$f":"IF(A15=\"\",0,1)","v":0},{"$f":"IF(B15=\"\",0,1)","v":0},0,0]
[null,null,null,null,{"$f":"IF(F16=SI_Programming_Gateways!$B$215,D105&C16&\".\"&D16,\"\")","v":""},{"$f":"IF(AND(A16<>\"\",B16<>\"\",C16<>\"\",D16<>\"\"),SI_Programming_Gateways!$B$215,SI_Programming_Gateways!$A$215)","v":"Î"},{"$f":"IF(AND(H16>0,F16=SI_Programming_Gateways!$A$215),1,0)","v":0},{"$f":"SUM(L16:O16)","v":0},null,null,{"$f":"IF(F16<>SI_Programming_Gateways!$A$215,E105&\", \"&C16&\" \"&$H$204&\", \"&D16&\" \"&$H$205,\"\")","v":""},{"$f":"IF(A16=\"\",0,1)","v":0},{"$f":"IF(B16=\"\",0,1)","v":0},{"$f":"IF(C16=\"\",0,1)","v":0},{"$f":"IF(D16=\"\",0,1)","v":0}]
[null,null,null,null,{"$f":"IF(F17=SI_Programming_Gateways!$B$215,D106&C17&\".\"&D17,\"\")","v":""},{"$f":"IF(AND(A17<>\"\",B17<>\"\",C17<>\"\",D17<>\"\"),SI_Programming_Gateways!$B$215,SI_Programming_Gateways!$A$215)","v":"Î"},{"$f":"IF(AND(H17>0,F17=SI_Programming_Gateways!$A$215),1,0)","v":0},0,null,null,{"$f":"IF(F17<>SI_Programming_Gateways!$A$215,E106&\", \"&C17&\" \"&$H$204&\", \"&D17&\" \"&$H$205,\"\")","v":""},0,0,0,0]
[null,null,null,null,{"$f":"IF(F18=SI_Programming_Gateways!$B$215,D107&C18&\".\"&D18,\"\")","v":""},{"$f":"IF(AND(A18<>\"\",B18<>\"\",C18<>\"\",D18<>\"\"),SI_Programming_Gateways!$B$215,SI_Programming_Gateways!$A$215)","v":"Î"},{"$f":"IF(AND(H18>0,F18=SI_Programming_Gateways!$A$215),1,0)","v":0},0,null,null,{"$f":"IF(F18<>SI_Programming_Gateways!$A$215,E107&\", \"&C18&\" \"&$H$204&\", \"&D18&\" \"&$H$205,\"\")","v":""},0,0,0,0]
[null,null,null,null,{"$f":"IF(F19=SI_Programming_Gateways!$B$215,D108&C19&\".\"&D19,\"\")","v":""},{"$f":"IF(AND(A19<>\"\",B19<>\"\",C19<>\"\",D19<>\"\"),SI_Programming_Gateways!$B$215,SI_Programming_Gateways!$A$215)","v":"Î"},{"$f":"IF(AND(H19>0,F19=SI_Programming_Gateways!$A$215),1,0)","v":0},0,null,null,{"$f":"IF(F19<>SI_Programming_Gateways!$A$215,E108&\", \"&C19&\" \"&$H$204&\", \"&D19&\" \"&$H$205,\"\")","v":""},0,0,0,0]
[null,null,null,null,null,null,{"$f":"SUM(G15:G19)","v":0},0,null,null,null,{"$f":"IF(A20=\"\",0,1)","v":0},{"$f":"IF(B20=\"\",0,1)","v":0},{"$f":"IF(C20=\"\",0,1)","v":0},{"$f":"IF(D20=\"\",0,1)","v":0}]
[]
[]
[{"$f":"H206","v":"SMART Tags MIFARE®"}]
[]
[{"$f":"A14","v":"Antal"},"Classic / DesFire","noch zu übersetzen","noch zu übersetzen","Varenummer","Korrekt varenummer?"]
[null,null,null,null,{"$f":"IF(F26=SI_Programming_Gateways!$B$215,D110&C26&\".\"&D26,\"\")","v":""},{"$f":"IF(AND(A26<>\"\",B26<>\"\",C26<>\"\",D26<>\"\"),SI_Programming_Gateways!$B$215,SI_Programming_Gateways!$A$215)","v":"Î"},{"$f":"IF(AND(H26>0,F26=SI_Programming_Gateways!$A$215),1,0)","v":0},0,null,null,{"$f":"IF(F26<>SI_Programming_Gateways!$A$215,E110&B26&\", \"&C26&\" \"&$H$204&\", \"&D26&\" \"&$H$205,\"\")","v":""},0,0,0,0]
[null,null,null,null,{"$f":"IF(F27=SI_Programming_Gateways!$B$215,D111&C27&\".\"&D27,\"\")","v":""},{"$f":"IF(AND(A27<>\"\",B27<>\"\",C27<>\"\",D27<>\"\"),SI_Programming_Gateways!$B$215,SI_Programming_Gateways!$A$215)","v":"Î"},{"$f":"IF(AND(H27>0,F27=SI_Programming_Gateways!$A$215),1,0)","v":0},0,null,null,{"$f":"IF(F27<>SI_Programming_Gateways!$A$215,E111&B27&\", \"&C27&\" \"&$H$204&\", \"&D27&\" \"&$H$205,\"\")","v":""},0,0,0,0]
[null,null,null,null,{"$f":"IF(F28=SI_Programming_Gateways!$B$215,D112&C28&\".\"&D28,\"\")","v":""},{"$f":"IF(AND(A28<>\"\",B28<>\"\",C28<>\"\",D28<>\"\"),SI_Programming_Gateways!$B$215,SI_Programming_Gateways!$A$215)","v":"Î"},{"$f":"IF(AND(H28>0,F28=SI_Programming_Gateways!$A$215),1,0)","v":0},0,null,null,{"$f":"IF(F28<>SI_Programming_Gateways!$A$215,E112&\", \"&C28&\" \"&$H$204&\", \"&D28&\" \"&$H$205,\"\")","v":""},0,0,0,0]
[null,null,null,null,{"$f":"IF(F29=SI_Programming_Gateways!$B$215,D113&C29&\".\"&D29,\"\")","v":""},{"$f":"IF(AND(A29<>\"\",B29<>\"\",C29<>\"\",D29<>\"\"),SI_Programming_Gateways!$B$215,SI_Programming_Gateways!$A$215)","v":"Î"},{"$f":"IF(AND(H29>0,F29=SI_Programming_Gateways!$A$215),1,0)","v":0},0,null,null,{"$f":"IF(F29<>SI_Programming_Gateways!$A$215,E113&B29&\", \"&C29&\" \"&$H$204&\", \"&D29&\" \"&$H$205,\"\")","v":""},0,0,0,0]
[null,null,null,null,{"$f":"IF(F30=SI_Programming_Gateways!$B$215,D114&C30&\".\"&D30,\"\")","v":""},{"$f":"IF(AND(A30<>\"\",B30<>\"\",C30<>\"\",D30<>\"\"),SI_Programming_Gateways!$B$215,SI_Programming_Gateways!$A$215)","v":"Î"},{"$f":"IF(AND(H30>0,F30=SI_Programming_Gateways!$A$215),1,0)","v":0},0,null,null,{"$f":"IF(F30<>SI_Programming_Gateways!$A$215,E114&B30&\", \"&C30&\" \"&$H$204&\", \"&D30&\" \"&$H$205,\"\")","v":""},0,0,0,0]
[null,null,null,null,null,null,{"$f":"SUM(G26:G30)","v":0},0]
[]
[null,null,null,null,null,null,{"$f":"G20+G31","v":0},"Summe ges,"]
[]
[]
[]
[]
[]
[]
[]
[]
[]
[]
[]
[]
[]
[]
[]
[]
[]
[]
[]
[]
[]
[]
[]
[]
[]
[]
[]
[]
[]
[]
[]
[]
[]
[]
[]
[]
[]
[]
[]
[]
[]
[]
[]
[]
[]
[]
[]
[]
[]
[]
[]
[]
[]
[]
[]
[]
[]
[null,"Für Cards & Tags"]
[null,1,2]
[null,"1k","2k"]
[null,"4k","4k"]
[null,null,"8k"]
[]
[]
[]
[null,"für Cards","für Tags","für Cards","für Tags","für Cards","für Tags"]
["Classic",1,1,"TRA.Mifare","TRA.Tag.Mifare","SmartCard Mifare Classic","SmartTag Mifare Classic"]
["DesFire",2,2,"TRA.Desfire","TRA.Tag.Desfire","SmartCard Mifare DESFire","SmartTag Mifare DESFire"]
[]
[]
["Zeile 15",{"$f":"VLOOKUP(B15,$A$100:$B$101,2,FALSE)","v":{"$error":"#N/A"}},{"$f":"VLOOKUP(B26,$A$100:$C$101,3,FALSE)","v":{"$error":"#N/A"}},{"$f":"VLOOKUP(B15,$A$100:$D$101,4,FALSE)","v":{"$error":"#N/A"}},{"$f":"VLOOKUP(B15,$A$100:$F$101,6,FALSE)","v":{"$error":"#N/A"}}]
["Zeile 16",{"$f":"VLOOKUP(B16,$A$100:$B$101,2,FALSE)","v":{"$error":"#N/A"}},{"$f":"VLOOKUP(B27,$A$100:$C$101,3,FALSE)","v":{"$error":"#N/A"}},{"$f":"VLOOKUP(B16,$A$100:$D$101,4,FALSE)","v":{"$error":"#N/A"}},{"$f":"VLOOKUP(B16,$A$100:$F$101,6,FALSE)","v":{"$error":"#N/A"}}]
["Zeile 17",{"$error":"#N/A"},{"$error":"#N/A"},{"$error":"#N/A"},{"$error":"#N/A"}]
["Zeile 18",{"$error":"#N/A"},{"$error":"#N/A"},{"$error":"#N/A"},{"$error":"#N/A"}]
["Zeile 19",{"$error":"#N/A"},{"$error":"#N/A"},{"$error":"#N/A"},{"$error":"#N/A"}]
[]
["Zeile 26",{"$f":"IF(B104=1,\"Mifare\",IF(B104=2,\"DesFire\",\"\"))","v":{"$error":"#N/A"}},{"$f":"IF(C104=1,\"Mifare\",IF(C104=2,\"DesFire\",\"\"))","v":{"$error":"#N/A"}},{"$f":"VLOOKUP(B26,$A$100:$E$101,5,FALSE)","v":{"$error":"#N/A"}},{"$f":"VLOOKUP(B26,$A$100:$G$101,7,FALSE)","v":{"$error":"#N/A"}},null,null,null,null,null," "]
["Zeile 27",{"$f":"IF(B105=1,\"Mifare\",IF(B105=2,\"DesFire\",\"\"))","v":{"$error":"#N/A"}},{"$f":"IF(C105=1,\"Mifare\",IF(C105=2,\"DesFire\",\"\"))","v":{"$error":"#N/A"}},{"$f":"VLOOKUP(B27,$A$100:$E$101,5,FALSE)","v":{"$error":"#N/A"}},{"$f":"VLOOKUP(B27,$A$100:$G$101,7,FALSE)","v":{"$error":"#N/A"}}]
["Zeile 28",{"$f":"IF(B106=1,\"Mifare\",IF(B106=2,\"DesFire\",\"\"))","v":{"$error":"#N/A"}},{"$error":"#N/A"},{"$error":"#N/A"},{"$error":"#N/A"}]
["Zeile 29",{"$error":"#N/A"},{"$error":"#N/A"},{"$error":"#N/A"},{"$error":"#N/A"}]
["Zeile 30",{"$error":"#N/A"},{"$error":"#N/A"},{"$error":"#N/A"},{"$error":"#N/A"}]
[]
[]
[]
[]
[]
[]
[]
[]
[]
[]
[]
[]
[]
[]
[]
[]
[]
[]
[]
[]
[]
[]
[]
[]
[]
[]
[]
[]
[]
[]
[]
[]
[]
[]
[]
[]
[]
[]
[]
[]
[]
[]
[]
[]
[]
[]
[]
[]
[]
[]
[]
[]
[]
[]
[]
[]
[]
[]
[]
[]
[]
[]
[]
[]
[]
[]
[]
[]
[]
[]
[]
[]
[]
[]
[]
[]
[]
[]
[]
[]
[]
[]
[]
[]
[]
["Deutsch","English","Français","Italiano","Nederlands","Dansk",1]
["Identifikationsmedium","ID-medium","noch zu übersetzen","noch zu übersetzen","noch zu übersetzen","noch zu übersetzen",2,{"$f":"HLOOKUP('Hauptseite - main page'!$G$3,'ID medium'!$A$200:$F$218,2,FALSE)","v":"noch zu übersetzen"},null,null,null,null,null,null,{"$f":"HLOOKUP(O1,'ID medium'!C200:N258,2,0)","v":{"$error":"#N/A"}}]
["Pincode Tastatur","pincode keypad","noch zu übersetzen","noch zu übersetzen","noch zu übersetzen","noch zu übersetzen",3,{"$f":"HLOOKUP('Hauptseite - main page'!$G$3,'ID medium'!$A$200:$F$218,3,FALSE)","v":"noch zu übersetzen"}]
["SmartCards Mifare","SmartCards Mifare","SmartCards Mifare","SmartCards Mifare","SmartCards Mifare","SmartCards Mifare",4,{"$f":"HLOOKUP('Hauptseite - main page'!$G$3,'ID medium'!$A$200:$F$218,4,FALSE)","v":"SmartCards Mifare"}]
["Speicher","memory","noch zu übersetzen","noch zu übersetzen","noch zu übersetzen","noch zu übersetzen",5,{"$f":"HLOOKUP('Hauptseite - main page'!$G$3,'ID medium'!$A$200:$F$218,5,FALSE)","v":"noch zu übersetzen"}]
["Stück / Set","items per Set","noch zu übersetzen","noch zu übersetzen","noch zu übersetzen","noch zu übersetzen",6,{"$f":"HLOOKUP('Hauptseite - main page'!$G$3,'ID medium'!$A$200:$F$218,6,FALSE)","v":"noch zu übersetzen"}]
["SMART Tags MIFARE®","SMART Tags MIFARE®","SMART Tags MIFARE®","SMART Tags MIFARE®","SMART Tags MIFARE®","SMART Tags MIFARE®",7,{"$f":"HLOOKUP('Hauptseite - main page'!$G$3,'ID medium'!$A$200:$F$218,7,FALSE)","v":"SMART Tags MIFARE®"}]
["Pincode Tastatur","pincode keypad","noch zu übersetzen","noch zu übersetzen","noch zu übersetzen","noch zu übersetzen",8,{"$f":"HLOOKUP('Hauptseite - main page'!$G$3,'ID medium'!$A$200:$F$227,8,FALSE)","v":"noch zu übersetzen"},null,null,null,null,"SI.Pincode",{"$f":"H207","v":"noch zu übersetzen"}]
["SmartCard MIFARE® Classic, 1k Speicher, weiß, Inhalt: 5 Stück","noch zu übersetzen","noch zu übersetzen","noch zu übersetzen","noch zu übersetzen","noch zu übersetzen",9,{"$f":"HLOOKUP('Hauptseite - main page'!$G$3,'ID medium'!$A$200:$F$227,9,FALSE)","v":"noch zu übersetzen"},null,null,null,null,"TRA.MIFARE1K.5",{"$f":"H208","v":"noch zu übersetzen"}]
["SmartCard MIFARE® Classic, 1k Speicher, weiß, Inhalt: 100 Stück","noch zu übersetzen","noch zu übersetzen","noch zu übersetzen","noch zu übersetzen","noch zu übersetzen",10,{"$f":"HLOOKUP('Hauptseite - main page'!$G$3,'ID medium'!$A$200:$F$227,10,FALSE)","v":"noch zu übersetzen"},null,null,null,null,"TRA.MIFARE1K.100","noch zu übersetzen"]
["SmartCard MIFARE® Classic, 4k Speicher, weiß, Inhalt: 5 Stück","noch zu übersetzen","noch zu übersetzen","noch zu übersetzen","noch zu übersetzen","noch zu übersetzen",11,{"$f":"HLOOKUP('Hauptseite - main page'!$G$3,'ID medium'!$A$200:$F$227,11,FALSE)","v":"noch zu übersetzen"},null,null,null,null,"TRA.MIFARE4K.5","noch zu übersetzen"]
["SmartCard MIFARE® Classic, 4k Speicher, weiß, Inhalt: 100 Stück","noch zu übersetzen","noch zu übersetzen","noch zu übersetzen","noch zu übersetzen","noch zu übersetzen",12,{"$f":"HLOOKUP('Hauptseite - main page'!$G$3,'ID medium'!$A$200:$F$227,12,FALSE)","v":"noch zu übersetzen"},null,null,null,null,"TRA.MIFARE4K.100","noch zu übersetzen"]
["SmartCard MIFARE® DESFire® EV1, 2k Speicher, weiß, Inhalt: 5 Stück","noch zu übersetzen","noch zu übersetzen","noch zu übersetzen","noch zu übersetzen","noch zu übersetzen",13,{"$f":"HLOOKUP('Hauptseite - main page'!$G$3,'ID medium'!$A$200:$F$227,13,FALSE)","v":"noch zu übersetzen"},null,null,null,null,"TRA.DESFIRE2K.5","noch zu übersetzen"]
["SmartCard MIFARE® DESFire® EV1, 2k Speicher, weiß, Inhalt: 100 Stück","noch zu übersetzen","noch zu übersetzen","noch zu übersetzen","noch zu übersetzen","noch zu übersetzen",14,{"$f":"HLOOKUP('Hauptseite - main page'!$G$3,'ID medium'!$A$200:$F$227,14,FALSE)","v":"noch zu übersetzen"},null,null,null,null,"TRA.DESFIRE2K.100","noch zu übersetzen"]
["SmartCard MIFARE® DESFire® EV1, 4k Speicher, weiß, Inhalt: 5 Stück","noch zu übersetzen","noch zu übersetzen","noch zu übersetzen","noch zu übersetzen","noch zu übersetzen",15,{"$f":"HLOOKUP('Hauptseite - main page'!$G$3,'ID medium'!$A$200:$F$227,15,FALSE)","v":"noch zu übersetzen"},null,null,null,null,"TRA.DESFIRE4K.5","noch zu übersetzen"]
["SmartCard MIFARE® DESFire® EV1, 4k Speicher, weiß, Inhalt: 100 Stück","noch zu übersetzen","noch zu übersetzen","noch zu übersetzen","noch zu übersetzen","noch zu übersetzen",16,{"$f":"HLOOKUP('Hauptseite - main page'!$G$3,'ID medium'!$A$200:$F$227,16,FALSE)","v":"noch zu übersetzen"},null,null,null,null,"TRA.DESFIRE4K.100","noch zu übersetzen"]
["SmartCard MIFARE® DESFire® EV1, 8k Speicher, weiß, Inhalt: 5 Stück","noch zu übersetzen","noch zu übersetzen","noch zu übersetzen","noch zu übersetzen","noch zu übersetzen",17,{"$f":"HLOOKUP('Hauptseite - main page'!$G$3,'ID medium'!$A$200:$F$227,17,FALSE)","v":"noch zu übersetzen"},null,null,null,null,"TRA.DESFIRE8K.5","noch zu übersetzen"]
["SmartCard MIFARE® DESFire® EV1, 8k Speicher, weiß, Inhalt: 100 Stück","noch zu übersetzen","noch zu übersetzen","noch zu übersetzen","noch zu übersetzen","noch zu übersetzen",18,{"$f":"HLOOKUP('Hauptseite - main page'!$G$3,'ID medium'!$A$200:$F$227,18,FALSE)","v":"noch zu übersetzen"},null,null,null,null,"TRA.DESFIRE8K.100","noch zu übersetzen"]
["SmartTag MIFARE® Classic, 1k Speicher, schwarz/weiß mit SimonsVoss-Logo, Inhalt: 5 Stück","noch zu übersetzen","noch zu übersetzen","noch zu übersetzen","noch zu übersetzen","noch zu übersetzen",19,{"$f":"HLOOKUP('Hauptseite - main page'!$G$3,'ID medium'!$A$200:$F$227,19,FALSE)","v":"noch zu übersetzen"},null,null,null,null,"TRA.TAG.MIFARE1K.5","noch zu übersetzen"]
["SmartTag MIFARE® Classic, 1k Speicher, schwarz/weiß mit SimonsVoss-Logo, Inhalt: 100 Stück","noch zu übersetzen","noch zu übersetzen","noch zu übersetzen","noch zu übersetzen","noch zu übersetzen",20,{"$f":"HLOOKUP('Hauptseite - main page'!$G$3,'ID medium'!$A$200:$F$227,20,FALSE)","v":"noch zu übersetzen"},null,null,null,null,"TRA.TAG.MIFARE1K.100","noch zu übersetzen"]
["SmartTag MIFARE® Classic, 4k Speicher, schwarz/weiß mit SimonsVoss-Logo, Inhalt: 5 Stück","noch zu übersetzen","noch zu übersetzen","noch zu übersetzen","noch zu übersetzen","noch zu übersetzen",21,{"$f":"HLOOKUP('Hauptseite - main page'!$G$3,'ID medium'!$A$200:$F$227,21,FALSE)","v":"noch zu übersetzen"},null,null,null,null,"TRA.TAG.MIFARE4K.5","noch zu übersetzen"]
["SmartTag MIFARE® Classic, 4k Speicher, schwarz/weiß mit SimonsVoss-Logo, Inhalt: 100 Stück","noch zu übersetzen","noch zu übersetzen","noch zu übersetzen","noch zu übersetzen","noch zu übersetzen",22,{"$f":"HLOOKUP('Hauptseite - main page'!$G$3,'ID medium'!$A$200:$F$227,22,FALSE)","v":"noch zu übersetzen"},null,null,null,null,"TRA.TAG.MIFARE4K.100","noch zu übersetzen"]
["SmartTag MIFARE® DESFire® EV1, 2k Speicher, schwarz/weiß mit SimonsVoss-Logo, Inhalt: 5 Stück","noch zu übersetzen","noch zu übersetzen","noch zu übersetzen","noch zu übersetzen","noch zu übersetzen",23,{"$f":"HLOOKUP('Hauptseite - main page'!$G$3,'ID medium'!$A$200:$F$227,23,FALSE)","v":"noch zu übersetzen"},null,null,null,null,"TRA.TAG.DESFIRE2K.5","noch zu übersetzen"]
["SmartTag MIFARE® DESFire® EV1, 2k Speicher, schwarz/weiß mit SimonsVoss-Logo, Inhalt: 100 Stück","noch zu übersetzen","noch zu übersetzen","noch zu übersetzen","noch zu übersetzen","noch zu übersetzen",24,{"$f":"HLOOKUP('Hauptseite - main page'!$G$3,'ID medium'!$A$200:$F$227,24,FALSE)","v":"noch zu übersetzen"},null,null,null,null,"TRA.TAG.DESFIRE2K.100",{"$f":"H223","v":"noch zu übersetzen"}]
["SmartTag MIFARE® DESFire® EV1, 4k Speicher, schwarz/weiß mit SimonsVoss-Logo, Inhalt: 5 Stück","noch zu übersetzen","noch zu übersetzen","noch zu übersetzen","noch zu übersetzen","noch zu übersetzen",25,{"$f":"HLOOKUP('Hauptseite - main page'!$G$3,'ID medium'!$A$200:$F$227,25,FALSE)","v":"noch zu übersetzen"},null,null,null,null,"TRA.TAG.DESFIRE4K.5",{"$f":"H224","v":"noch zu übersetzen"}]
["SmartTag MIFARE® DESFire® EV1, 4k Speicher, schwarz/weiß mit SimonsVoss-Logo, Inhalt: 100 Stück","noch zu übersetzen","noch zu übersetzen","noch zu übersetzen","noch zu übersetzen","noch zu übersetzen",26,{"$f":"HLOOKUP('Hauptseite - main page'!$G$3,'ID medium'!$A$200:$F$227,26,FALSE)","v":"noch zu übersetzen"},null,null,null,null,"TRA.TAG.DESFIRE4K.100",{"$f":"H225","v":"noch zu übersetzen"}]
["SmartTag MIFARE® DESFire® EV1, 8k Speicher, schwarz/weiß mit SimonsVoss-Logo, Inhalt: 5 Stück","noch zu übersetzen","noch zu übersetzen","noch zu übersetzen","noch zu übersetzen","noch zu übersetzen",27,{"$f":"HLOOKUP('Hauptseite - main page'!$G$3,'ID medium'!$A$200:$F$227,27,FALSE)","v":"noch zu übersetzen"},null,null,null,null,"TRA.TAG.DESFIRE8K.5",{"$f":"H226","v":"noch zu übersetzen"}]
["SmartTag MIFARE® DESFire® EV1, 8k Speicher, schwarz/weiß mit SimonsVoss-Logo, Inhalt: 100 Stück","noch zu übersetzen","noch zu übersetzen","noch zu übersetzen","noch zu übersetzen","noch zu übersetzen",28,{"$f":"HLOOKUP('Hauptseite - main page'!$G$3,'ID medium'!$A$200:$F$227,28,FALSE)","v":"noch zu übersetzen"},null,null,null,null,"TRA.TAG.DESFIRE8K.100",{"$f":"H227","v":"noch zu übersetzen"}]
[null,null,null,null,null,null,29]
[null,null,null,null,null,null,30]
[null,null,null,null,null,null,31]
[null,null,null,null,null,null,32,null,null,null,null,"Digitales Vorhängeschloss SmartIntego mit einem Bügeldurchmesser von  8 mm und Bügelinnenhöhe von 60 mm, nicht selbstverriegelnd, interne Stromversorgung, Schließung von außen mit SmartCards/SmartTags in MIFARE® Classic, MIFARE Plus® oder MIFARE® DESFire® EV1, sowie die UID nach DIN 14443 von MIFARE®, Legic Advant und HID iClass, keine Verkabelung erforderlich, Vorhängeschloss Abmessungen: (BxHxT) ohne Zylinderknauf 51 x 70 x 25 mm","Digital Padlock SmartIntego with a shackle diameter of 8 mm and shackle inside height of 60 mm; non-self-locking; powered internally; locking device operated on outside with smart cards/smart tags in MIFARE® Classic, MIFARE Plus® or MIFARE® DESFire® EV1 format and with MIFARE®, Legic Advant and HID iClass UID as per DIN 14443; no cabling required; padlock dimensions: (W x H x D) without cylinder thumb-turn 51 x 70 x 25 mm"]
[null,null,null,null,null,null,33,null,null,null,null,"Digitales Vorhängeschloss SmartIntego mit einem Bügeldurchmesser von 8 mm und Bügelinnenhöhe von 60 mm, selbstverriegelnd, interne Stromversorgung, Schließung von außen mit SmartCards/SmartTags in MIFARE® Classic, MIFARE Plus® oder MIFARE® DESFire® EV1, sowie die UID nach DIN 14443 von MIFARE®, Legic Advant und HID iClass, keine Verkabelung erforderlich, Vorhängeschloss Abmessungen: (BxHxT) ohne Zylinderknauf 51 x 70 x 25 mm ","Digital Padlock SmartIntego with a shackle diameter of 8 mm and shackle inside height of 60 mm; self-locking; powered internally; locking device operated on outside with smart cards/smart tags in MIFARE® Classic, MIFARE Plus® or MIFARE® DESFire® EV1 format and with MIFARE®, Legic Advant and HID iClass UID as per DIN 14443; no cabling required; padlock dimensions: (W x H x D) without cylinder thumb-turn 51 x 70 x 25 mm "]
[null,null,null,null,null,null,34,null,null,null,"SI.Z4.PL.08.60.MI.ML.WP","Digitales Vorhängeschloss SmartIntego mit einem Bügeldurchmesser von 11 mm und Bügelinnenhöhe von 35 mm, nicht selbstverriegelnd, interne Stromversorgung, Schließung von außen mit SmartCards/SmartTags in MIFARE® Classic, MIFARE Plus® oder MIFARE® DESFire® EV1, sowie die UID nach DIN 14443 von MIFARE®, Legic Advant und HID iClass, keine Verkabelung erforderlich, Vorhängeschloss Abmessungen: (BxHxT) ohne Zylinderknauf 60 x 72,5 x 25 mm ","Digital Padlock SmartIntego with a shackle diameter of 11 mm and shackle inside height of 35 mm; non-self-locking; powered internally; locking device operated on outside with smart cards/smart tags in MIFARE® Classic,  MIFARE Plus® or MIFARE® DESFire® EV1 format and with MIFARE®, Legic Advant and HID iClass UID as per DIN 14443; no cabling required; padlock dimensions: (W x H x D) without cylinder thumb-turn 60 x 72.5 x 25 mm "]
[null,null,null,null,null,null,35,null,null,null,"SI.Z4.PL.08.60.MI.SL.WP","Digitales Vorhängeschloss SmartIntego mit einem Bügeldurchmesser von 11 mm und Bügelinnenhöhe von 50 mm, selbstverriegelnd, interne Stromversorgung, Schließung von außen mit SmartCards/SmartTags in MIFARE® Classic, MIFARE Plus® oder MIFARE® DESFire® EV1, sowie die UID nach DIN 14443 von MIFARE®, Legic Advant und HID iClass, keine Verkabelung erforderlich, Vorhängeschloss Abmessungen: (BxHxT) ohne Zylinderknauf 60 x 72,5 x 25 mm","Digital Padlock SmartIntego with a shackle diameter of 11 mm and shackle inside height of 50 mm; self-locking; powered internally; locking device operated on outside with smart cards/smart tags in MIFARE® Classic, MIFARE Plus® or MIFARE® DESFire® EV1 format and with MIFARE®, Legic Advant and HID iClass UID as per DIN 14443; no cabling required; padlock dimensions: (W x H x D) without cylinder thumb-turn 60 x 72.5 x 25 mm"]
[null,null,null,null,null,null,36,null,null,null,"SI.Z4.PL.11.35.MI.ML.WP","Sicherungskette für Vorhängeschloss mit 11 mm Bügeldurchmesser, Länge ca. 30 cm","Securing chain for padlocks; shackle diameter: 11 mm; length: about 30 cm"]
[null,null,null,null,null,null,37,null,null,null,"SI.Z4.PL.11.50.MI.SL.WP","Sicherungskette für Vorhängeschloss mit 8 mm Bügeldurchmesser, Länge ca. 30 cm","Securing chain for padlocks; shackle diameter: 8 mm; length: about 30 cm"]
[null,null,null,null,null,null,38,null,null,null,"PL.CHAIN.11.30","Wandhalterung für Sicherungskette","Wall bracket for securing chain"]
[null,null,null,null,null,null,39,null,null,null,"PL.CHAIN.08.30","PinCode-Terminal - SmartIntego: Batteriebetriebene, verkabelungsfreies PinCode-Terminal mit 868MHz Funkschnittstelle als Identifikationsmedium, silberfarbenes ABS-Kunststoffgehäuse, Schutzart IP 65","PIN code Terminal - SmartIntego: Battery-operated, wireless PIN code terminal with 868 MHz wireless interface as identification medium, silver-coloured, ABS plastic housing, weather protection rating IP65"]
[null,null,null,null,null,null,40,null,null,null,"PL.CHAIN.BRACKET","Externes Steckernetzteil 12 VDC / 500 mA / 6 VA für SI.GN2.ER(.M), mit Klinkenstecker 5,5 mm, Anschlussleitung ca. 1,5 m","External plug-in power supply 12 V DC / 500 mA / 6 VA for SI.GN2.ER(.M); with 5.5 mm jack plug, connecting cable: about 1.5 m"]
[null,null,null,null,null,null,41,null,null,null,"SI.PINCODE","Montage-/Batterieschlüssel: Spezialwerkzeug für die Demontage sowie den Batteriewechsel (Knopfzellen) in TN4-Zylindern (Doppelknauf- und Halbzylinder)","Installation/battery key: special tool for disassembly and for replacing batteries (button cells) in TN4 cylinders (double thumb-turn and half cylinders)"]
[null,null,null,null,null,null,42,null,null,null,"POWER.SUPPLY.2","Digitales Vorhängeschloss SmartIntego mit einem Bügeldurchmesser von 8 mm und Bügelinnenhöhe von 60 mm – nicht selbstverriegelnd","SmartIntego Digital Padlock with a shackle diameter of 8 mm and shackle inside height of 60 mm – non-self-locking"]
[null,null,null,null,null,null,43,null,null,null,"Z4.SCHLUESSEL","Digitales Vorhängeschloss SmartIntego mit einem Bügeldurchmesser von 8 mm und Bügelinnenhöhe von 60 mm – selbstverriegelnd","SmartIntego Digital Padlock with a shackle diameter of 8 mm and shackle inside height of 60 mm – self-locking"]
[null,null,null,null,null,null,44,null,null,null,"SI.Z4.PL.08.60.M.ML.WP","Digitales Vorhängeschloss SmartIntego mit einem Bügeldurchmesser von 11 mm und Bügelinnenhöhe von 35 mm – nicht selbstverriegelnd","SmartIntego Digital Padlock with a shackle diameter of 11 mm and shackle inside height of 35 mm – non-self-locking"]
[null,null,null,null,null,null,45,null,null,null,"SI.Z4.PL.08.60.M.SL.WP","Digitales Vorhängeschloss SmartIntego mit einem Bügeldurchmesser von 11 mm und Bügelinnenhöhe von 50 mm – selbstverriegelnd","SmartIntego Digital Padlock with a shackle diameter of 11 mm and shackle inside height of 50 mm – self-locking"]
[null,null,null,null,null,null,46,null,null,null,"SI.Z4.PL.11.35.M.ML.WP","Demo-Modell Digitaler Schließzylinder","Demo model of Digital Locking Cylinder"]
[null,null,null,null,null,null,47,null,null,null,"SI.Z4.PL.11.50.M.SL.WP","Demo-Modell Digitales SmartHandle","Demo model of Digital SmartHandle"]
[null,null,null,null,null,null,48,null,null,null,"SI.MOCKUP.Z4.MI","Demo-Modell Digitales SmartHandle DoorMonitoring","Demo model of Digital SmartHandle DoorMonitoring"]
[null,null,null,null,null,null,49,null,null,null,"SI.MOCKUP.SH.A","Stabiler Alukoffer für Mock-ups","Robust aluminium case for mock-ups"]
[null,null,null,null,null,null,50]
[null,null,null,null,null,null,51,null,null,null,"MK"]
[null,null,null,null,null,null,52]
[null,null,null,null,null,null,53]
[null,null,null,null,null,null,54]
[null,null,null,null,null,null,55]
[null,null,null,null,null,null,56]
[null,null,null,null,null,null,57]
[null,null,null,null,null,null,58]
[null,null,null,null,null,null,59]
[null,null,null,null,null,null,60]
[null,null,null,null,null,null,61]
[null,null,null,null,null,null,62]
[null,null,null,null,null,null,63]
[null,null,null,null,null,null,64]
[null,null,null,null,null,null,65]
[null,null,null,null,null,null,66]
[null,null,null,null,null,null,67]
[null,null,null,null,null,null,68]
[null,null,null,null,null,null,69]
[null,null,null,null,null,null,70]
[null,null,null,null,null,null,71]
[null,null,null,null,null,null,72]
[null,null,null,null,null,null,73]
[null,null,null,null,null,null,74]
[null,null,null,null,null,null,75]
[null,null,null,null,null,null,76]
[null,null,null,null,null,null,77]
[null,null,null,null,null,null,78]
[null,null,null,null,null,null,79]
[null,null,null,null,null,null,80]
[null,null,null,null,null,null,81]
[null,null,null,null,null,null,82]
[null,null,null,null,null,null,83]
[null,null,null,null,null,null,84]
[null,null,null,null,null,null,85]
[null,null,null,null,null,null,86]
[null,null,null,null,null,null,87]
[null,null,null,null,null,null,88]
[null,null,null,null,null,null,89]
[null,null,null,null,null,null,90]
[null,null,null,null,null,null,91]
[null,null,null,null,null,null,92]
[null,null,null,null,null,null,93]
[null,null,null,null,null,null,94]
[null,null,null,null,null,null,95]
[null,null,null,null,null,null,96]
[null,null,null,null,null,null,97]
[null,null,null,null,null,null,98]
[null,null,null,null,null,null,99]
[null,null,null,null,null,null,100]
[null,null,null,null,null,null,101]
[null,null,null,null,null,null,102]
[null,null,null,null,null,null,103]
[null,null,null,null,null,null,104]
[null,null,null,null,null,null,105]
[null,null,null,null,null,null,106]
[null,null,null,null,null,null,107]
[null,null,null,null,null,null,108]
[null,null,null,null,null,null,109]
[null,null,null,null,null,null,110]
[null,null,null,null,null,null,111]
[null,null,null,null,null,null,112]
[null,null,null,null,null,null,113]
[null,null,null,null,null,null,114]
[null,null,null,null,null,null,115]
[null,null,null,null,null,null,116]
[null,null,null,null,null,null,117]
[null,null,null,null,null,null,118]
[null,null,null,null,null,null,119]
[null,null,null,null,null,null,120]
[null,null,null,null,null,null,121]
[null,null,null,null,null,null,122]
[null,null,null,null,null,null,123]
[null,null,null,null,null,null,124]
[null,null,null,null,null,null,125]
[null,null,null,null,null,null,126]
[null,null,null,null,null,null,127]
[null,null,null,null,null,null,128]
[null,null,null,null,null,null,129]
[null,null,null,null,null,null,130]
[null,null,null,null,null,null,131]
[null,null,null,null,null,null,132]
[null,null,null,null,null,null,133]
[null,null,null,null,null,null,134]
[null,null,null,null,null,null,135]
[null,null,null,null,null,null,136]
[null,null,null,null,null,null,137]
[null,null,null,null,null,null,138]
[null,null,null,null,null,null,139]
[null,null,null,null,null,null,140]
[null,null,null,null,null,null,141]
[null,null,null,null,null,null,142]
[null,null,null,null,null,null,143]
[null,null,null,null,null,null,144]
[null,null,null,null,null,null,145]
[null,null,null,null,null,null,146]
[null,null,null,null,null,null,147]
[null,null,null,null,null,null,148]
[null,null,null,null,null,null,149]
[null,null,null,null,null,null,150]
[null,null,null,null,null,null,151]
[null,null,null,null,null,null,152]
[null,null,null,null,null,null,153]
[null,null,null,null,null,null,154]
[null,null,null,null,null,null,155]
[null,null,null,null,null,null,156]
[null,null,null,null,null,null,157]
[null,null,null,null,null,null,158]
[null,null,null,null,null,null,159]
[null,null,null,null,null,null,160]
[null,null,null,null,null,null,161]
[null,null,null,null,null,null,162]
[null,null,null,null,null,null,163]
[null,null,null,null,null,null,164]
[null,null,null,null,null,null,165]
[null,null,null,null,null,null,166]
[null,null,null,null,null,null,167]
[null,null,null,null,null,null,168]
[null,null,null,null,null,null,169]
[null,null,null,null,null,null,170]
[null,null,null,null,null,null,171]
[null,null,null,null,null,null,172]
[null,null,null,null,null,null,173]
[null,null,null,null,null,null,174]
[null,null,null,null,null,null,175]
[null,null,null,null,null,null,176]
[null,null,null,null,null,null,177]
[null,null,null,null,null,null,178]
[null,null,null,null,null,null,179]
[null,null,null,null,null,null,180]
[null,null,null,null,null,null,181]
[null,null,null,null,null,null,182]
[null,null,null,null,null,null,183]
[null,null,null,null,null,null,184]
[null,null,null,null,null,null,185]
[null,null,null,null,null,null,186]
[null,null,null,null,null,null,187]
[null,null,null,null,null,null,188]
[null,null,null,null,null,null,189]
[null,null,null,null,null,null,190]
[null,null,null,null,null,null,191]
[null,null,null,null,null,null,192]
[null,null,null,null,null,null,193]
[null,null,null,null,null,null,194]
[null,null,null,null,null,null,195]
[null,null,null,null,null,null,196]
[null,null,null,null,null,null,197]
[null,null,null,null,null,null,198]
[null,null,null,null,null,null,199]
[null,null,null,null,null,null,200]
[null,null,null,null,null,null,201]
[null,null,null,null,null,null,202]
[null,null,null,null,null,null,203]
[null,null,null,null,null,null,204]
[null,null,null,null,null,null,205]
[null,null,null,null,null,null,206]
[null,null,null,null,null,null,207]
[null,null,null,null,null,null,208]
[null,null,null,null,null,null,209]
[null,null,null,null,null,null,210]
[null,null,null,null,null,null,211]
[null,null,null,null,null,null,212]
[null,null,null,null,null,null,213]
[null,null,null,null,null,null,214]
[null,null,null,null,null,null,215]
[null,null,null,null,null,null,216]
[null,null,null,null,null,null,217]
[null,null,null,null,null,null,218]
[null,null,null,null,null,null,219]
[null,null,null,null,null,null,220]
[null,null,null,null,null,null,221]
[null,null,null,null,null,null,222]
[null,null,null,null,null,null,223]
[null,null,null,null,null,null,224]
[null,null,null,null,null,null,225]
[null,null,null,null,null,null,226]
[null,null,null,null,null,null,227]
[null,null,null,null,null,null,228]
[null,null,null,null,null,null,229]
[null,null,null,null,null,null,230]
[null,null,null,null,null,null,231]
[null,null,null,null,null,null,232]
[null,null,null,null,null,null,233]
[null,null,null,null,null,null,234]
[null,null,null,null,null,null,235]
[null,null,null,null,null,null,236]
[null,null,null,null,null,null,237]
[null,null,null,null,null,null,238]
[null,null,null,null,null,null,239]
[null,null,null,null,null,null,240]
[null,null,null,null,null,null,241]
[null,null,null,null,null,null,242]
[null,null,null,null,null,null,243]
[null,null,null,null,null,null,244]
[null,null,null,null,null,null,245]
[null,null,null,null,null,null,246]
[null,null,null,null,null,null,247]
[null,null,null,null,null,null,248]
[null,null,null,null,null,null,249]
[null,null,null,null,null,null,250]
[null,null,null,null,null,null,251]
[null,null,null,null,null,null,252]
[null,null,null,null,null,null,253]
[null,null,null,null,null,null,254]
[null,null,null,null,null,null,255]
[null,null,null,null,null,null,256]
[null,null,null,null,null,null,257]
[null,null,null,null,null,null,258]
[null,null,null,null,null,null,259]
[null,null,null,null,null,null,260]
[null,null,null,null,null,null,261]
[null,null,null,null,null,null,262]
[null,null,null,null,null,null,263]
[null,null,null,null,null,null,264]
[null,null,null,null,null,null,265]
[null,null,null,null,null,null,266]
[null,null,null,null,null,null,267]
[null,null,null,null,null,null,268]
[null,null,null,null,null,null,269]
[null,null,null,null,null,null,270]
[null,null,null,null,null,null,271]
[null,null,null,null,null,null,272]
[null,null,null,null,null,null,273]
[null,null,null,null,null,null,274]
[null,null,null,null,null,null,275]
[null,null,null,null,null,null,276]
[null,null,null,null,null,null,277]
[null,null,null,null,null,null,278]
[null,null,null,null,null,null,279]
[null,null,null,null,null,null,280]
[null,null,null,null,null,null,281]
[null,null,null,null,null,null,282]
[null,null,null,null,null,null,283]
[null,null,null,null,null,null,284]
[null,null,null,null,null,null,285]
[null,null,null,null,null,null,286]
[null,null,null,null,null,null,287]
[null,null,null,null,null,null,288]
[null,null,null,null,null,null,289]
[null,null,null,null,null,null,290]
[null,null,null,null,null,null,291]
[null,null,null,null,null,null,292]
[null,null,null,null,null,null,293]
[null,null,null,null,null,null,294]
[null,null,null,null,null,null,295]
[null,null,null,null,null,null,296]
[null,null,null,null,null,null,297]
[null,null,null,null,null,null,298]
[null,null,null,null,null,null,299]
[null,null,null,null,null,null,300]
[null,null,null,null,null,null,301]
[null,null,null,null,null,null,302]
[null,null,null,null,null,null,303]
[null,null,null,null,null,null,304]
[null,null,null,null,null,null,305]
[null,null,null,null,null,null,306]
[null,null,null,null,null,null,307]
[null,null,null,null,null,null,308]
[null,null,null,null,null,null,309]
[null,null,null,null,null,null,310]
[null,null,null,null,null,null,311]
[null,null,null,null,null,null,312]
[null,null,null,null,null,null,313]
[null,null,null,null,null,null,314]
[null,null,null,null,null,null,315]
[null,null,null,null,null,null,316]
[null,null,null,null,null,null,317]
[null,null,null,null,null,null,318]
[null,null,null,null,null,null,319]
[null,null,null,null,null,null,320]
[null,null,null,null,null,null,321]
[null,null,null,null,null,null,322]
[null,null,null,null,null,null,323]
[null,null,null,null,null,null,324]
[null,null,null,null,null,null,325]
[null,null,null,null,null,null,326]
[null,null,null,null,null,null,327]
[null,null,null,null,null,null,328]
[null,null,null,null,null,null,329]
[null,null,null,null,null,null,330]
[null,null,null,null,null,null,331]
[null,null,null,null,null,null,332]
[null,null,null,null,null,null,333]
[null,null,null,null,null,null,334]
[null,null,null,null,null,null,335]
[null,null,null,null,null,null,336]
[null,null,null,null,null,null,337]
[null,null,null,null,null,null,338]
[null,null,null,null,null,null,339]
[null,null,null,null,null,null,340]
[null,null,null,null,null,null,341]
[null,null,null,null,null,null,342]
[null,null,null,null,null,null,343]
[null,null,null,null,null,null,344]
[null,null,null,null,null,null,345]
[null,null,null,null,null,null,346]
[null,null,null,null,null,null,347]
[null,null,null,null,null,null,348]
[null,null,null,null,null,null,349]
[null,null,null,null,null,null,350]
[null,null,null,null,null,null,351]
[null,null,null,null,null,null,352]
[null,null,null,null,null,null,353]
[null,null,null,null,null,null,354]
[null,null,null,null,null,null,355]
[null,null,null,null,null,null,356]
[null,null,null,null,null,null,357]
[null,null,null,null,null,null,358]
[null,null,null,null,null,null,359]
[null,null,null,null,null,null,360]
[null,null,null,null,null,null,361]
[null,null,null,null,null,null,362]
[null,null,null,null,null,null,363]
[null,null,null,null,null,null,364]
[null,null,null,null,null,null,365]
[null,null,null,null,null,null,366]
[null,null,null,null,null,null,367]
[null,null,null,null,null,null,368]
[null,null,null,null,null,null,369]
[null,null,null,null,null,null,370]
[null,null,null,null,null,null,371]
[null,null,null,null,null,null,372]
[null,null,null,null,null,null,373]
[null,null,null,null,null,null,374]
[null,null,null,null,null,null,375]
[null,null,null,null,null,null,376]
[null,null,null,null,null,null,377]
[null,null,null,null,null,null,378]
[null,null,null,null,null,null,379]
[null,null,null,null,null,null,380]
[null,null,null,null,null,null,381]
[null,null,null,null,null,null,382]
[null,null,null,null,null,null,383]
[null,null,null,null,null,null,384]
[null,null,null,null,null,null,385]
[null,null,null,null,null,null,386]
[null,null,null,null,null,null,387]
[null,null,null,null,null,null,388]
[null,null,null,null,null,null,389]
[null,null,null,null,null,null,390]
[null,null,null,null,null,null,391]
[null,null,null,null,null,null,392]
[null,null,null,null,null,null,393]
[null,null,null,null,null,null,394]
[null,null,null,null,null,null,395]
[null,null,null,null,null,null,396]
[null,null,null,null,null,null,397]
[null,null,null,null,null,null,398]
[null,null,null,null,null,null,399]
[null,null,null,null,null,null,400]
[null,null,null,null,null,null,401]
[null,null,null,null,null,null,402]
[null,null,null,null,null,null,403]
[null,null,null,null,null,null,404]
[null,null,null,null,null,null,405]
[null,null,null,null,null,null,406]
[null,null,null,null,null,null,407]
[null,null,null,null,null,null,408]
[null,null,null,null,null,null,409]
[null,null,null,null,null,null,410]
[null,null,null,null,null,null,411]
[null,null,null,null,null,null,412]
[null,null,null,null,null,null,413]
[null,null,null,null,null,null,414]
[null,null,null,null,null,null,415]
[null,null,null,null,null,null,416]
[null,null,null,null,null,null,417]
[null,null,null,null,null,null,418]
[null,null,null,null,null,null,419]
[null,null,null,null,null,null,420]
[null,null,null,null,null,null,421]
[null,null,null,null,null,null,422]
[null,null,null,null,null,null,423]
[null,null,null,null,null,null,424]
[null,null,null,null,null,null,425]
[null,null,null,null,null,null,426]
[null,null,null,null,null,null,427]
[null,null,null,null,null,null,428]
[null,null,null,null,null,null,429]
[null,null,null,null,null,null,430]
[null,null,null,null,null,null,431]
[null,null,null,null,null,null,432]
[null,null,null,null,null,null,433]
[null,null,null,null,null,null,434]
[null,null,null,null,null,null,435]
[null,null,null,null,null,null,436]
[null,null,null,null,null,null,437]
[null,null,null,null,null,null,438]
[null,null,null,null,null,null,439]
[null,null,null,null,null,null,440]
[null,null,null,null,null,null,441]
[null,null,null,null,null,null,442]
[null,null,null,null,null,null,443]
[null,null,null,null,null,null,444]
[null,null,null,null,null,null,445]
[null,null,null,null,null,null,446]
[null,null,null,null,null,null,447]
[null,null,null,null,null,null,448]
[null,null,null,null,null,null,449]
[null,null,null,null,null,null,450]
[null,null,null,null,null,null,451]
[null,null,null,null,null,null,452]
[null,null,null,null,null,null,453]
[null,null,null,null,null,null,454]
[null,null,null,null,null,null,455]
[null,null,null,null,null,null,456]
[null,null,null,null,null,null,457]
[null,null,null,null,null,null,458]
[null,null,null,null,null,null,459]
[null,null,null,null,null,null,460]
[null,null,null,null,null,null,461]
[null,null,null,null,null,null,462]
[null,null,null,null,null,null,463]
[null,null,null,null,null,null,464]
[null,null,null,null,null,null,465]
[null,null,null,null,null,null,466]
[null,null,null,null,null,null,467]
[null,null,null,null,null,null,468]
[null,null,null,null,null,null,469]
[null,null,null,null,null,null,470]
[null,null,null,null,null,null,471]
[null,null,null,null,null,null,472]
[null,null,null,null,null,null,473]
[null,null,null,null,null,null,474]
[null,null,null,null,null,null,475]
[null,null,null,null,null,null,476]
[null,null,null,null,null,null,477]
[null,null,null,null,null,null,478]
[null,null,null,null,null,null,479]
[null,null,null,null,null,null,480]
[null,null,null,null,null,null,481]
[null,null,null,null,null,null,482]
[null,null,null,null,null,null,483]
[null,null,null,null,null,null,484]
[null,null,null,null,null,null,485]
[null,null,null,null,null,null,486]
[null,null,null,null,null,null,487]
[null,null,null,null,null,null,488]
[null,null,null,null,null,null,489]
[null,null,null,null,null,null,490]
[null,null,null,null,null,null,491]
[null,null,null,null,null,null,492]
[null,null,null,null,null,null,493]
[null,null,null,null,null,null,494]
[null,null,null,null,null,null,495]
[null,null,null,null,null,null,496]
[null,null,null,null,null,null,497]

{"sheet":"Tabelle2","index":18,"n_rows":0,"n_cols":0,"rows_kept":0,"cut":false,"hidden":true,"merged":[]}

{"sheet":"OF-No.","index":19,"n_rows":1413,"n_cols":9,"rows_kept":1413,"cut":false,"hidden":true,"merged":[]}
["SV Nr.","OF - Nr.","Kategorie",null,null,null,null,null,{"$f":"'Hauptseite - main page'!B24","v":"Smarthandle"}]
["SI.SHAL08B721AA1AWP","OF10000",{"$f":"$I$1","v":"Smarthandle"},null,null,null,null,null,{"$f":"'Hauptseite - main page'!E24","v":"noch zu übersetzen"}]
["SI.SHAL08B882AA1A","OF10001",{"$f":"$I$1","v":"Smarthandle"},null,null,null,null,null,{"$f":"'Hauptseite - main page'!K227","v":"noch zu übersetzen"}]
["SI.SHAL08B921DD1A","OF10002","Smarthandle",null,null,null,null,null,{"$f":"'Hauptseite - main page'!J24","v":"noch zu übersetzen"}]
["SI.SHAL08C001AA1A","OF10003","Smarthandle",null,null,null,null,null,{"$f":"'Hauptseite - main page'!K228","v":"noch zu übersetzen"}]
["SI.SHAL08C001BB1A","OF10004","Smarthandle"]
["SI.SHAL09A721CC1A","OF10005","Smarthandle"]
["SI.SHAL09A721CC1AWP","OF10006","Smarthandle"]
["SI.SHAL09A721DD13","OF10007","Smarthandle"]
["SI.SHAL09A721DD1A","OF10008","Smarthandle"]
["SI.SHAL09A901CC1A","OF10009","Smarthandle"]
["SI.SHAL09A921AA1A","OF10010","Smarthandle"]
["SI.SHAL09A921BB1A","OF10011","Smarthandle"]
["SI.SHAL09A921CC1A","OF10012","Smarthandle"]
["SI.SHAL09A921CC1AWP","OF10013","Smarthandle"]
["SI.SHAL09A921EE1A","OF10014","Smarthandle"]
["SI.SHAL09A921FF13","OF10015","Smarthandle"]
["SI.SHAL09A921FF1A","OF10016","Smarthandle"]
["SI.SHAL09A941CC1A","OF10017","Smarthandle"]
["SI.SHAL09B721DD1A","OF10018","Smarthandle"]
["SI.SHAL09B722DD1A","OF10019","Smarthandle"]
["SI.SHAL09C001FF1A","OF10020","Smarthandle"]
["SI.SHALF8B721DD1A","OF10021","Smarthandle"]
["SI.SHAM07A701BB1A","OF10022","Smarthandle"]
["SI.SHAM07A721AA13","OF10023","Smarthandle"]
["SI.SHAM07A724AA13","OF10024","Smarthandle"]
["SI.SHAM07B881CC1A","OF10025","Smarthandle"]
["SI.SHAM07C001AA1A","OF10026","Smarthandle"]
["SI.SHAM08A701CC1A","OF10027","Smarthandle"]
["SI.SHAM08A721AA1A","OF10028","Smarthandle"]
["SI.SHAM08A721BB1A","OF10029","Smarthandle"]
["SI.SHAM08A721CC13","OF10030","Smarthandle"]
["SI.SHAM08A721DD13","OF10031","Smarthandle"]
["SI.SHAM08A721DD1A","OF10032","Smarthandle"]
["SI.SHAM08A751AA1A","OF10033","Smarthandle"]
["SI.SHAM08A752AA1A","OF10034","Smarthandle"]
["SI.SHAM08A851AA1A","OF10035","Smarthandle"]
["SI.SHAM08A851CC1AWP","OF10036","Smarthandle"]
["SI.SHAM08A881CC1A","OF10037","Smarthandle"]
["SI.SHAM08A901CC13","OF10038","Smarthandle"]
["SI.SHAM08A901CC1AWP","OF10039","Smarthandle"]
["SI.SHAM08A921BB1AWP","OF10040","Smarthandle"]
["SI.SHAM08A921CC1A","OF10041","Smarthandle"]
["SI.SHAM08A921CC1AWP","OF10042","Smarthandle"]
["SI.SHAM08A921DD13","OF10043","Smarthandle"]
["SI.SHAM08A921DD1A","OF10044","Smarthandle"]
["SI.SHAM08A921DD1AWP","OF10045","Smarthandle"]
["SI.SHAM08A921EE1A","OF10046","Smarthandle"]
["SI.SHAM08A921FD1AWP","OF10047","Smarthandle"]
["SI.SHAM08A921FF1A","OF10048","Smarthandle"]
["SI.SHAM08B721BB1A","OF10049","Smarthandle"]
["SI.SHAM08B721CC13WP","OF10050","Smarthandle"]
["SI.SHAM08B721DD1A","OF10051","Smarthandle"]
["SI.SHAM08B851AA1A","OF10052","Smarthandle"]
["SI.SHAM08B881AA1AWP","OF10053","Smarthandle"]
["SI.SHAM08B881CC13","OF10054","Smarthandle"]
["SI.SHAM08B901BB1A","OF10055","Smarthandle"]
["SI.SHAM08B921BB1AWP","OF10056","Smarthandle"]
["SI.SHAM08B921DD1A","OF10057","Smarthandle"]
["SI.SHAM08C001AA1A","OF10058","Smarthandle"]
["SI.SHAM08C001CC13","OF10059","Smarthandle"]
["SI.SHAM08C001EE1A","OF10060","Smarthandle"]
["SI.SHAM09A721AA13","OF10061","Smarthandle"]
["SI.SHAM09A721AA1A","OF10062","Smarthandle"]
["SI.SHAM09A721BB1A","OF10063","Smarthandle"]
["SI.SHAM09A721BB1AWP","OF10064","Smarthandle"]
["SI.SHAM09A721CC13","OF10065",{"$f":"$I$1","v":"Smarthandle"}]
["SI.SHAM09A721CC1A","OF10066","Smarthandle"]
["SI.SHAM09A721CC1AWP","OF10067","Smarthandle"]
["SI.SHAM09A721DD13","OF10068","Smarthandle"]
["SI.SHAM09A721DD1A","OF10069","Smarthandle"]
["SI.SHAM09A721FF1A","OF10070","Smarthandle"]
["SI.SHAM09A722CC1A","OF10071","Smarthandle"]
["SI.SHAM09A881AA1A","OF10072","Smarthandle"]
["SI.SHAM09A901CC1A","OF10073","Smarthandle"]
["SI.SHAM09A921BB1A","OF10074","Smarthandle"]
["SI.SHAM09A921BB1AWP","OF10075","Smarthandle"]
["SI.SHAM09A921CC13WP","OF10076","Smarthandle"]
["SI.SHAM09A921CC1A","OF10077","Smarthandle"]
["SI.SHAM09A921CC1AWP","OF10078","Smarthandle"]
["SI.SHAM09A921CE1A","OF10079","Smarthandle"]
["SI.SHAM09A921DD1A","OF10080","Smarthandle"]
["SI.SHAM09A921DD1AWP","OF10081","Smarthandle"]
["SI.SHAM09A921DF1AWP","OF10082","Smarthandle"]
["SI.SHAM09A921EE1A","OF10083","Smarthandle"]
["SI.SHAM09A921FF13","OF10084","Smarthandle"]
["SI.SHAM09A921FF1A","OF10085","Smarthandle"]
["SI.SHAM09A921FF1AWP","OF10086","Smarthandle"]
["SI.SHAM09A922EE1AWP","OF10087","Smarthandle"]
["SI.SHAM09B701CC1A","OF10088","Smarthandle"]
["SI.SHAM09B721AA1A","OF10089","Smarthandle"]
["SI.SHAM09B721BB1A","OF10090","Smarthandle"]
["SI.SHAM09B721CC13","OF10091","Smarthandle"]
["SI.SHAM09B721CC1A","OF10092","Smarthandle"]
["SI.SHAM09B721CC1AWP","OF10093","Smarthandle"]
["SI.SHAM09B721DD1A","OF10094","Smarthandle"]
["SI.SHAM09B722DD1A","OF10095","Smarthandle"]
["SI.SHAM09B901FF1A","OF10096","Smarthandle"]
["SI.SHAM09B921CC13WP","OF10097","Smarthandle"]
["SI.SHAM09B921DD1A","OF10098","Smarthandle"]
["SI.SHAM09C001AA1A","OF10099","Smarthandle"]
["SI.SHAM10A921CC1AWP","OF10100","Smarthandle"]
["SI.SHAM10B721DD1A","OF10101","Smarthandle"]
["SI.SHAM10B921BB1A","OF10102","Smarthandle"]
["SI.SHAM10B921BB1AWP","OF10103","Smarthandle"]
["SI.SHAM10B921CC1A","OF10104","Smarthandle"]
["SI.SHAMF8A721AA1A","OF10105","Smarthandle"]
["SI.SHAMF8A721BB1A","OF10106","Smarthandle"]
["SI.SHAMF8A881BB1A","OF10107","Smarthandle"]
["SI.SHAMF8B721CC1A","OF10108","Smarthandle"]
["SI.SHAMF8B921CC1A","OF10109","Smarthandle"]
["SI.SHAS07A701AA1A","OF10110","Smarthandle"]
["SI.SHAS07A701BB1A","OF10111","Smarthandle"]
["SI.SHAS07A701CC1A","OF10112","Smarthandle"]
["SI.SHAS07A701CC1AWP","OF10113","Smarthandle"]
["SI.SHAS07A702CC1A","OF10114","Smarthandle"]
["SI.SHAS07A703CC1A","OF10115","Smarthandle"]
["SI.SHAS07A721AA1A","OF10116","Smarthandle"]
["SI.SHAS07A721BB1A","OF10117","Smarthandle"]
["SI.SHAS07A721CC1A","OF10118","Smarthandle"]
["SI.SHAS07B701AA1A","OF10119","Smarthandle"]
["SI.SHAS07B701BB1A","OF10120","Smarthandle"]
["SI.SHAS07B701CC1A","OF10121","Smarthandle"]
["SI.SHAS07B702CC1A","OF10122","Smarthandle"]
["SI.SHAS07B721AA1A","OF10123","Smarthandle"]
["SI.SHAS07C001AA1A","OF10124","Smarthandle"]
["SI.SHAS07C001CC13","OF10125","Smarthandle"]
["SI.SHAS07C001CC1A","OF10126","Smarthandle"]
["SI.SHAS08A701CC1A","OF10127","Smarthandle"]
["SI.SHAS08A721AA13","OF10128","Smarthandle"]
["SI.SHAS08A721AA1A","OF10129",{"$f":"$I$1","v":"Smarthandle"}]
["SI.SHAS08A721AA1AWP","OF10130","Smarthandle"]
["SI.SHAS08A721BB13","OF10131","Smarthandle"]
["SI.SHAS08A721BB1A","OF10132","Smarthandle"]
["SI.SHAS08A721CC13","OF10133","Smarthandle"]
["SI.SHAS08A721CC1A","OF10134","Smarthandle"]
["SI.SHAS08A721CC3A","OF10135","Smarthandle"]
["SI.SHAS08A721CE13","OF10136","Smarthandle"]
["SI.SHAS08A721DD13","OF10137","Smarthandle"]
["SI.SHAS08A721DD1AWP","OF10138","Smarthandle"]
["SI.SHAS08A721FF1A","OF10139","Smarthandle"]
["SI.SHAS08A722AA1A","OF10140","Smarthandle"]
["SI.SHAS08A722CC1A","OF10141","Smarthandle"]
["SI.SHAS08A724AA1A","OF10142","Smarthandle"]
["SI.SHAS08A751CC1A","OF10143","Smarthandle"]
["SI.SHAS08A781AA1A","OF10144","Smarthandle"]
["SI.SHAS08A781CC1A","OF10145","Smarthandle"]
["SI.SHAS08A781CC1AWP","OF10146","Smarthandle"]
["SI.SHAS08A851AA13","OF10147","Smarthandle"]
["SI.SHAS08A851AA1A","OF10148","Smarthandle"]
["SI.SHAS08A851AA1AWP","OF10149","Smarthandle"]
["SI.SHAS08A851CC1A","OF10150","Smarthandle"]
["SI.SHAS08A852AA1A","OF10151","Smarthandle"]
["SI.SHAS08A852CC1A","OF10152","Smarthandle"]
["SI.SHAS08A854CC13","OF10153","Smarthandle"]
["SI.SHAS08A881AA1A","OF10154","Smarthandle"]
["SI.SHAS08A881BB1A","OF10155","Smarthandle"]
["SI.SHAS08A881CC13","OF10156","Smarthandle"]
["SI.SHAS08A881CC1A","OF10157","Smarthandle"]
["SI.SHAS08A901AA1A","OF10158","Smarthandle"]
["SI.SHAS08A921AA1A","OF10159","Smarthandle"]
["SI.SHAS08A921AA1AWP","OF10160","Smarthandle"]
["SI.SHAS08A921CC1AWP","OF10161","Smarthandle"]
["SI.SHAS08A941CC1A","OF10162","Smarthandle"]
["SI.SHAS08B701BB1A","OF10163","Smarthandle"]
["SI.SHAS08B701CC1A","OF10164","Smarthandle"]
["SI.SHAS08B720BB10","OF10165","Smarthandle"]
["SI.SHAS08B721AA1A","OF10166","Smarthandle"]
["SI.SHAS08B721AA1AWP","OF10167","Smarthandle"]
["SI.SHAS08B721BB1A","OF10168","Smarthandle"]
["SI.SHAS08B721CC13","OF10169","Smarthandle"]
["SI.SHAS08B721CC1A","OF10170","Smarthandle"]
["SI.SHAS08B721CC1AWP","OF10171","Smarthandle"]
["SI.SHAS08B721DD1A","OF10172","Smarthandle"]
["SI.SHAS08B722DD1A","OF10173","Smarthandle"]
["SI.SHAS08B751CC1A","OF10174","Smarthandle"]
["SI.SHAS08B780BB10","OF10175","Smarthandle"]
["SI.SHAS08B781AA1A","OF10176","Smarthandle"]
["SI.SHAS08B851AA1A","OF10177","Smarthandle"]
["SI.SHAS08B851CC1A","OF10178","Smarthandle"]
["SI.SHAS08B851CC1AWP","OF10179","Smarthandle"]
["SI.SHAS08B881AA1A","OF10180","Smarthandle"]
["SI.SHAS08B881AA1AWP","OF10181","Smarthandle"]
["SI.SHAS08B881BB1A","OF10182","Smarthandle"]
["SI.SHAS08B881CC13","OF10183","Smarthandle"]
["SI.SHAS08B881CC1A","OF10184","Smarthandle"]
["SI.SHAS08B881DD1A","OF10185","Smarthandle"]
["SI.SHAS08B901BB1A","OF10186","Smarthandle"]
["SI.SHAS08B901CC1A","OF10187","Smarthandle"]
["SI.SHAS08B921BB1AWP","OF10188","Smarthandle"]
["SI.SHAS08B921CC1A","OF10189","Smarthandle"]
["SI.SHAS08B921CC1AWP","OF10190","Smarthandle"]
["SI.SHAS08C001AA13","OF10191","Smarthandle"]
["SI.SHAS08C001AA1A","OF10192","Smarthandle"]
["SI.SHAS08C001AA1AWP","OF10193",{"$f":"$I$1","v":"Smarthandle"}]
["SI.SHAS08C001CC13","OF10194","Smarthandle"]
["SI.SHAS08C001CC1A","OF10195","Smarthandle"]
["SI.SHAS08C001DD13","OF10196","Smarthandle"]
["SI.SHAS08C001DD1A","OF10197","Smarthandle"]
["SI.SHAS08C001FF13WP","OF10198","Smarthandle"]
["SI.SHAS08D001AA1A","OF10199","Smarthandle"]
["SI.SHAS08D001AA1AWP","OF10200","Smarthandle"]
["SI.SHAS08D001CK1ADP","OF10201","Smarthandle"]
["SI.SHAS09A701AA13","OF10202","Smarthandle"]
["SI.SHAS09A721AA13","OF10203","Smarthandle"]
["SI.SHAS09A721AA1A","OF10204","Smarthandle"]
["SI.SHAS09A721BB1A","OF10205","Smarthandle"]
["SI.SHAS09A721CC13","OF10206","Smarthandle"]
["SI.SHAS09A721CC1A","OF10207","Smarthandle"]
["SI.SHAS09A721CC1AWP","OF10208","Smarthandle"]
["SI.SHAS09A721DD13","OF10209","Smarthandle"]
["SI.SHAS09A721DD1A","OF10210","Smarthandle"]
["SI.SHAS09A721DD1AWP","OF10211","Smarthandle"]
["SI.SHAS09A721FF1A","OF10212","Smarthandle"]
["SI.SHAS09A722AA1A","OF10213","Smarthandle"]
["SI.SHAS09A722CC1A","OF10214","Smarthandle"]
["SI.SHAS09A722CC1AWP","OF10215","Smarthandle"]
["SI.SHAS09A881CC13","OF10216","Smarthandle"]
["SI.SHAS09A881CC1A","OF10217","Smarthandle"]
["SI.SHAS09A921BB1A","OF10218","Smarthandle"]
["SI.SHAS09A921BB1AWP","OF10219","Smarthandle"]
["SI.SHAS09A921BF1AWP","OF10220","Smarthandle"]
["SI.SHAS09A921CC13","OF10221","Smarthandle"]
["SI.SHAS09A921CC1AWP","OF10222","Smarthandle"]
["SI.SHAS09A921CE1A","OF10223","Smarthandle"]
["SI.SHAS09A921DD1AWP","OF10224","Smarthandle"]
["SI.SHAS09A921FF13","OF10225","Smarthandle"]
["SI.SHAS09A922BB1AWP","OF10226","Smarthandle"]
["SI.SHAS09A922CE1A","OF10227","Smarthandle"]
["SI.SHAS09B721AA1A","OF10228","Smarthandle"]
["SI.SHAS09B721AA1AWP","OF10229","Smarthandle"]
["SI.SHAS09B721BB1A","OF10230","Smarthandle"]
["SI.SHAS09B721CC13WP","OF10231","Smarthandle"]
["SI.SHAS09B721CC1A","OF10232","Smarthandle"]
["SI.SHAS09B721CC1AWP","OF10233","Smarthandle"]
["SI.SHAS09B881AA1A","OF10234","Smarthandle"]
["SI.SHAS09B921CC13","OF10235","Smarthandle"]
["SI.SHAS09B921CC1A","OF10236","Smarthandle"]
["SI.SHAS09C001AA1A","OF10237","Smarthandle"]
["SI.SHAS10B901BB1A","OF10238","Smarthandle"]
["SI.SHASF8A721AA1A","OF10239","Smarthandle"]
["SI.SHASF8A721CC1A","OF10240","Smarthandle"]
["SI.SHASF8A722CC1A","OF10241","Smarthandle"]
["SI.SHASF8A723CC1A","OF10242","Smarthandle"]
["SI.SHASF8A881BB1A","OF10243","Smarthandle"]
["SI.SHASF8A881CC1A","OF10244","Smarthandle"]
["SI.SHASF8B721AA1A","OF10245","Smarthandle"]
["SI.SHASF8B881CC1A","OF10246","Smarthandle"]
["SI.SHASF8B881DD1A","OF10247","Smarthandle"]
["SI.SHASF8B921DD1A","OF10248","Smarthandle"]
["SI.SHASF8C001AA1A","OF10249","Smarthandle"]
["SI.SHASF8C001CC1A","OF10250","Smarthandle"]
["SI.SHBL08C051AA1A","OF10251","Smarthandle"]
["SI.SHBL08C051AA1AWP","OF10252","Smarthandle"]
["SI.SHBL08C051CC1A","OF10253","Smarthandle"]
["SI.SHBL08C051CC1AWP","OF10254","Smarthandle"]
["SI.SHBL08D051AA1A","OF10255","Smarthandle"]
["SI.SHBL08D051AA1AWP","OF10256","Smarthandle"]
["SI.SHBM08C051AA1A","OF10257",{"$f":"$I$1","v":"Smarthandle"}]
["SI.SHBM08C051AA1AWP","OF10258","Smarthandle"]
["SI.SHBM08C051BB1A","OF10259","Smarthandle"]
["SI.SHBM08C051CC1A","OF10260","Smarthandle"]
["SI.SHBM08C051CC1AWP","OF10261","Smarthandle"]
["SI.SHBM08C054CC1A","OF10262","Smarthandle"]
["SI.SHBM08C961AA1A","OF10263","Smarthandle"]
["SI.SHBM08D051AA1A","OF10264","Smarthandle"]
["SI.SHBM08D051AA1AWP","OF10265","Smarthandle"]
["SI.SHBM08D051AA3A","OF10266","Smarthandle"]
["SI.SHBM08D051CC1A","OF10267","Smarthandle"]
["SI.SHBS08C051AA1A","OF10268","Smarthandle"]
["SI.SHBS08C051AA1AWP","OF10269","Smarthandle"]
["SI.SHBS08C051BB1A","OF10270","Smarthandle"]
["SI.SHBS08C051CC13","OF10271","Smarthandle"]
["SI.SHBS08C051CC1A","OF10272","Smarthandle"]
["SI.SHBS08C051CC1AWP","OF10273","Smarthandle"]
["SI.SHBS08C053AA1A","OF10274","Smarthandle"]
["SI.SHBS08C054CC1A","OF10275","Smarthandle"]
["SI.SHBS08D051AA1A","OF10276","Smarthandle"]
["SI.SHBS08D051AA1AWP","OF10277","Smarthandle"]
["SI.SHBS08D051CC1A","OF10278","Smarthandle"]
["SI.SHBS08D051CC1AWP","OF10279","Smarthandle"]
["SI.SHCL08E851AA1AWP","OF10280","Smarthandle"]
["SI.SHCL08K001BB1A","OF10281","Smarthandle"]
["SI.SHCL09E721BB1A","OF10282","Smarthandle"]
["SI.SHCL09E721DD1A","OF10283","Smarthandle"]
["SI.SHCL09E921CC1AWP","OF10284","Smarthandle"]
["SI.SHCL09E921CE1A","OF10285","Smarthandle"]
["SI.SHCL09F721CC1A","OF10286","Smarthandle"]
["SI.SHCLF8E721DD1A","OF10287","Smarthandle"]
["SI.SHCM07G721CC13","OF10288","Smarthandle"]
["SI.SHCM07G721CC13WP","OF10289","Smarthandle"]
["SI.SHCM08E721BB1A","OF10290","Smarthandle"]
["SI.SHCM08E721CC13","OF10291","Smarthandle"]
["SI.SHCM08E721CC13WP","OF10292","Smarthandle"]
["SI.SHCM08E721CC1A","OF10293","Smarthandle"]
["SI.SHCM08E721CC1AWP","OF10294","Smarthandle"]
["SI.SHCM08E851AA1A","OF10295","Smarthandle"]
["SI.SHCM08E851AA1AWP","OF10296","Smarthandle"]
["SI.SHCM08E921CC13WP","OF10297","Smarthandle"]
["SI.SHCM08E921CC1AWP","OF10298","Smarthandle"]
["SI.SHCM08F721EE1A","OF10299","Smarthandle"]
["SI.SHCM08F850AA10","OF10300","Smarthandle"]
["SI.SHCM08F881CC1AWP","OF10301","Smarthandle"]
["SI.SHCM08G721CC13","OF10302","Smarthandle"]
["SI.SHCM08G721CC13WP","OF10303","Smarthandle"]
["SI.SHCM08K001CC1A","OF10304","Smarthandle"]
["SI.SHCM09E721CC13","OF10305","Smarthandle"]
["SI.SHCM09E721CC1A","OF10306","Smarthandle"]
["SI.SHCM09E721DD1A","OF10307","Smarthandle"]
["SI.SHCM09E921BB1A","OF10308","Smarthandle"]
["SI.SHCM09E921BB1AWP","OF10309","Smarthandle"]
["SI.SHCM09E921DD1AWP","OF10310","Smarthandle"]
["SI.SHCM09E921EE1A","OF10311","Smarthandle"]
["SI.SHCM09E921EE1AWP","OF10312","Smarthandle"]
["SI.SHCM09F721AA1AWP","OF10313","Smarthandle"]
["SI.SHCM09F721BB1A","OF10314","Smarthandle"]
["SI.SHCM09F721CC13","OF10315","Smarthandle"]
["SI.SHCM09F721CC1A","OF10316","Smarthandle"]
["SI.SHCM09F721DD1A","OF10317","Smarthandle"]
["SI.SHCM09F881CC1A","OF10318","Smarthandle"]
["SI.SHCM09F921CC1A","OF10319","Smarthandle"]
["SI.SHCS07E721CC13","OF10320","Smarthandle"]
["SI.SHCS07E721CC13WP","OF10321",{"$f":"$I$1","v":"Smarthandle"}]
["SI.SHCS07E721CC1A","OF10322","Smarthandle"]
["SI.SHCS07E721CC1AWP","OF10323","Smarthandle"]
["SI.SHCS07F721CC1A","OF10324","Smarthandle"]
["SI.SHCS07G721AA1A","OF10325","Smarthandle"]
["SI.SHCS07G721CC13","OF10326","Smarthandle"]
["SI.SHCS07G721CC13WP","OF10327","Smarthandle"]
["SI.SHCS07G721CC1A","OF10328","Smarthandle"]
["SI.SHCS07G721CC1AWP","OF10329","Smarthandle"]
["SI.SHCS07I721AA1AWP","OF10330","Smarthandle"]
["SI.SHCS07J721AA1AWP","OF10331","Smarthandle"]
["SI.SHCS07K001AA1A","OF10332","Smarthandle"]
["SI.SHCS07K001CC1A","OF10333","Smarthandle"]
["SI.SHCS08E721AA1A","OF10334","Smarthandle"]
["SI.SHCS08E721AA1AWP","OF10335","Smarthandle"]
["SI.SHCS08E721BB13","OF10336","Smarthandle"]
["SI.SHCS08E721BB1A","OF10337","Smarthandle"]
["SI.SHCS08E721BB1AWP","OF10338","Smarthandle"]
["SI.SHCS08E721CC13","OF10339","Smarthandle"]
["SI.SHCS08E721CC13WP","OF10340","Smarthandle"]
["SI.SHCS08E721CC1A","OF10341","Smarthandle"]
["SI.SHCS08E721CC1AWP","OF10342","Smarthandle"]
["SI.SHCS08E721DD1A","OF10343","Smarthandle"]
["SI.SHCS08E850AA10","OF10344","Smarthandle"]
["SI.SHCS08E851AA1A","OF10345","Smarthandle"]
["SI.SHCS08E851AA1AWP","OF10346","Smarthandle"]
["SI.SHCS08E851CC1A","OF10347","Smarthandle"]
["SI.SHCS08E881BB1A","OF10348","Smarthandle"]
["SI.SHCS08E881CC13","OF10349","Smarthandle"]
["SI.SHCS08E881CC1A","OF10350","Smarthandle"]
["SI.SHCS08E901CC1A","OF10351","Smarthandle"]
["SI.SHCS08E921AA1AWP","OF10352","Smarthandle"]
["SI.SHCS08E921BB1A","OF10353","Smarthandle"]
["SI.SHCS08E921CC1A","OF10354","Smarthandle"]
["SI.SHCS08F720BB10","OF10355","Smarthandle"]
["SI.SHCS08F721BB1A","OF10356","Smarthandle"]
["SI.SHCS08F721CC13","OF10357","Smarthandle"]
["SI.SHCS08F721CC1A","OF10358","Smarthandle"]
["SI.SHCS08F721DD1A","OF10359","Smarthandle"]
["SI.SHCS08F721EE1A","OF10360","Smarthandle"]
["SI.SHCS08F751CC1A","OF10361","Smarthandle"]
["SI.SHCS08F851AA1A","OF10362","Smarthandle"]
["SI.SHCS08F881AA1A","OF10363","Smarthandle"]
["SI.SHCS08F881BB1A","OF10364","Smarthandle"]
["SI.SHCS08F881CC13","OF10365","Smarthandle"]
["SI.SHCS08F881CC1A","OF10366","Smarthandle"]
["SI.SHCS08F881DD1A","OF10367","Smarthandle"]
["SI.SHCS08F901CC1A","OF10368","Smarthandle"]
["SI.SHCS08G721AA1A","OF10369","Smarthandle"]
["SI.SHCS08G721CC1A","OF10370","Smarthandle"]
["SI.SHCS08K000CC10","OF10371","Smarthandle"]
["SI.SHCS08K001AA1A","OF10372","Smarthandle"]
["SI.SHCS08K001BB1A","OF10373","Smarthandle"]
["SI.SHCS08K001BB1AWP","OF10374","Smarthandle"]
["SI.SHCS08K001CC1A","OF10375","Smarthandle"]
["SI.SHCS09E721AA1A","OF10376","Smarthandle"]
["SI.SHCS09E721AA1AWP","OF10377","Smarthandle"]
["SI.SHCS09E721BB1A","OF10378","Smarthandle"]
["SI.SHCS09E721CC13","OF10379","Smarthandle"]
["SI.SHCS09E721CC1A","OF10380","Smarthandle"]
["SI.SHCS09E881AA1A","OF10381","Smarthandle"]
["SI.SHCS09E901CC13WP","OF10382","Smarthandle"]
["SI.SHCS09E921CC13WP","OF10383","Smarthandle"]
["SI.SHCS09E921DD1AWP","OF10384","Smarthandle"]
["SI.SHCS09E921EE1A","OF10385",{"$f":"$I$1","v":"Smarthandle"}]
["SI.SHCS09F721CC1A","OF10386","Smarthandle"]
["SI.SHCS09F721DD1A","OF10387","Smarthandle"]
["SI.SHCS09F881CC13","OF10388","Smarthandle"]
["SI.SHCS09F881CC1A","OF10389","Smarthandle"]
["SI.SHCS09K001CC1A","OF10390","Smarthandle"]
["SI.SHCSF8E721CC1A","OF10391","Smarthandle"]
["SI.SHCSF8F881AA1A","OF10392","Smarthandle"]
["SI.SHCSF8F881CC13","OF10393","Smarthandle"]
["SI.SHCSF8F881DD1A","OF10394","Smarthandle"]
["SI.SHDL09F941FF1A","OF10395","Smarthandle"]
["SI.SHDM08F781BB1A","OF10396","Smarthandle"]
["SI.SHDM08F781CC1AWP","OF10397","Smarthandle"]
["SI.SHDM09E921EE1AWP","OF10398","Smarthandle"]
["SI.SHDM09E941EE1AWP","OF10399","Smarthandle"]
["SI.SHDM09F781BB1A","OF10400","Smarthandle"]
["SI.SHDS08F781BB1A","OF10401","Smarthandle"]
["SI.SHDS09F741BB1A","OF10402","Smarthandle"]
["SI.SHDS09F781BB1A","OF10403","Smarthandle"]
["SI.SHEL08G051AA1A","OF10404","Smarthandle"]
["SI.SHEL08G054CC1A","OF10405","Smarthandle"]
["SI.SHEL08H051AA1A","OF10406","Smarthandle"]
["SI.SHEL08H051AA1AWP","OF10407","Smarthandle"]
["SI.SHEL08H051BB1A","OF10408","Smarthandle"]
["SI.SHEL08L051AA1AWP","OF10409","Smarthandle"]
["SI.SHEM08E051AA1A","OF10410","Smarthandle"]
["SI.SHEM08E051CC1A","OF10411","Smarthandle"]
["SI.SHEM08E051DD1AWP","OF10412","Smarthandle"]
["SI.SHEM08E054CC1A","OF10413","Smarthandle"]
["SI.SHEM08F051AA1A","OF10414","Smarthandle"]
["SI.SHEM08F054CC1A","OF10415","Smarthandle"]
["SI.SHEM08G051AA1A","OF10416","Smarthandle"]
["SI.SHEM08G051AA1AWP","OF10417","Smarthandle"]
["SI.SHEM08G051CC1A","OF10418","Smarthandle"]
["SI.SHEM08G054CC1A","OF10419","Smarthandle"]
["SI.SHEM08H051AA1A","OF10420","Smarthandle"]
["SI.SHEM08H051AA1AWP","OF10421","Smarthandle"]
["SI.SHEM08H051AA3A","OF10422","Smarthandle"]
["SI.SHEM08I054CC1A","OF10423","Smarthandle"]
["SI.SHEM08J051AA1A","OF10424","Smarthandle"]
["SI.SHEM08K004CC1A","OF10425","Smarthandle"]
["SI.SHEM08L051AA1A","OF10426","Smarthandle"]
["SI.SHES08E051AA1A","OF10427","Smarthandle"]
["SI.SHES08E051CC13","OF10428","Smarthandle"]
["SI.SHES08E051CC1A","OF10429","Smarthandle"]
["SI.SHES08E051DD1AWP","OF10430","Smarthandle"]
["SI.SHES08E054CC1A","OF10431","Smarthandle"]
["SI.SHES08F051AA1A","OF10432","Smarthandle"]
["SI.SHES08G051AA1A","OF10433","Smarthandle"]
["SI.SHES08G051AA3A","OF10434","Smarthandle"]
["SI.SHES08G051BB1A","OF10435","Smarthandle"]
["SI.SHES08G051CA1A","OF10436","Smarthandle"]
["SI.SHES08G051CC1A","OF10437","Smarthandle"]
["SI.SHES08G054CC1A","OF10438","Smarthandle"]
["SI.SHES08H051AA1A","OF10439","Smarthandle"]
["SI.SHES08H051AA3A","OF10440","Smarthandle"]
["SI.SHES08H051BB1A","OF10441","Smarthandle"]
["SI.SHES08H051CC1A","OF10442","Smarthandle"]
["SI.SHES08H051CC1AWP","OF10443","Smarthandle"]
["SI.SHES08I051CC1A","OF10444","Smarthandle"]
["SI.SHES08L051AA1A","OF10445","Smarthandle"]
["SI.SHFL09F721CC13WP","OF10446","Smarthandle"]
["SI.SHFL09F721CC1A","OF10447","Smarthandle"]
["SI.SHFL09F921EE1A","OF10448","Smarthandle"]
["SI.SHFM08F721BB1A","OF10449",{"$f":"$I$1","v":"Smarthandle"}]
["SI.SHFM08F721CC13","OF10450","Smarthandle"]
["SI.SHFM08F721CC1A","OF10451","Smarthandle"]
["SI.SHFM08F881CC1A","OF10452","Smarthandle"]
["SI.SHFM08F921CC1AWP","OF10453","Smarthandle"]
["SI.SHFM09F721BB1A","OF10454","Smarthandle"]
["SI.SHFM09F721CC13","OF10455","Smarthandle"]
["SI.SHFM09F721CC1A","OF10456","Smarthandle"]
["SI.SHFM09F921EE1A","OF10457","Smarthandle"]
["SI.SHFM09F921EE1AWP","OF10458","Smarthandle"]
["SI.SHFS08F721CC1A","OF10459","Smarthandle"]
["SI.SHFS08F751CC1A","OF10460","Smarthandle"]
["SI.SHFS08F881CC1A","OF10461","Smarthandle"]
["SI.SHFS08H721AA1A","OF10462","Smarthandle"]
["SI.SHFS09F721CC1A","OF10463","Smarthandle"]
["SI.SHFS09F921CC1A","OF10464","Smarthandle"]
["SI.SHFS09F921EE1A","OF10465","Smarthandle"]
["SI.SHFS09F921EE1AWP","OF10466","Smarthandle"]
["SI.SHFS09H721AA1A","OF10467","Smarthandle"]
["SI.SHFSF8F881AA1A","OF10468","Smarthandle"]
["SI.SHHL09E921CC1A","OF10469","Smarthandle"]
["SI.SHHM08E921CC1AWP","OF10470","Smarthandle"]
["SI.SMARTCD","OF10471",{"$f":"$I$3","v":"noch zu übersetzen"}]
["SI.SW","OF10472",{"$f":"$I$3","v":"noch zu übersetzen"}]
["SI.TESTER.BAMO.EU","OF10473","noch zu übersetzen"]
["SI.TESTER.BASIS.EU","OF10474","noch zu übersetzen"]
["SI.TESTER.MOBILE.EU","OF10475","noch zu übersetzen"]
["SI.Z4.30-10.M.HZ","OF10476",{"$f":"$I$2","v":"noch zu übersetzen"}]
["SI.Z4.30-10.M.HZ.DK","OF10477",{"$f":"$I$2","v":"noch zu übersetzen"}]
["SI.Z4.30-10.M.HZ.DK.WP","OF10478","noch zu übersetzen"]
["SI.Z4.30-10.M.HZ.MR","OF10479","noch zu übersetzen"]
["SI.Z4.30-10.M.HZ.MR.WP","OF10480","noch zu übersetzen"]
["SI.Z4.30-10.M.HZ.MR.WP.MS","OF10481","noch zu übersetzen"]
["SI.Z4.30-10.M.HZ.MS","OF10482","noch zu übersetzen"]
["SI.Z4.30-10.M.HZ.SL","OF10483","noch zu übersetzen"]
["SI.Z4.30-10.M.HZ.WP","OF10484","noch zu übersetzen"]
["SI.Z4.30-10.MI.HZ","OF10485","noch zu übersetzen"]
["SI.Z4.30-10.MI.HZ.DK","OF10486","noch zu übersetzen"]
["SI.Z4.30-10.MI.HZ.DK.WP","OF10487","noch zu übersetzen"]
["SI.Z4.30-10.MI.HZ.MR","OF10488","noch zu übersetzen"]
["SI.Z4.30-10.MI.HZ.SL","OF10489","noch zu übersetzen"]
["SI.Z4.30-10.MI.HZ.WP","OF10490","noch zu übersetzen"]
["SI.Z4.30-30.M.AP2.FD","OF10491","noch zu übersetzen"]
["SI.Z4.30-30.M.CO","OF10492","noch zu übersetzen"]
["SI.Z4.30-30.M.CO.MS","OF10493","noch zu übersetzen"]
["SI.Z4.30-30.M.CO.WP","OF10494","noch zu übersetzen"]
["SI.Z4.30-30.M.FD.SKG","OF10495","noch zu übersetzen"]
["SI.Z4.30-30.MI.AP2.BL","OF10496","noch zu übersetzen"]
["SI.Z4.30-30.MI.AP2.BL.WP","OF10497","noch zu übersetzen"]
["SI.Z4.30-30.MI.AP2.FD","OF10498","noch zu übersetzen"]
["SI.Z4.30-30.MI.AP2.FD.WP","OF10499","noch zu übersetzen"]
["SI.Z4.30-30.MI.CO","OF10500","noch zu übersetzen"]
["SI.Z4.30-30.MI.CO.MS","OF10501","noch zu übersetzen"]
["SI.Z4.30-30.MI.CO.WP","OF10502","noch zu übersetzen"]
["SI.Z4.30-30.MI.FD","OF10503","noch zu übersetzen"]
["SI.Z4.30-30.MI.FD.SKG","OF10504","noch zu übersetzen"]
["SI.Z4.30-35.M.AP2.FD","OF10505","noch zu übersetzen"]
["SI.Z4.30-35.M.AP2.FD.WP","OF10506","noch zu übersetzen"]
["SI.Z4.30-35.M.CO","OF10507","noch zu übersetzen"]
["SI.Z4.30-35.M.CO.MS","OF10508","noch zu übersetzen"]
["SI.Z4.30-35.M.CO.WP","OF10509","noch zu übersetzen"]
["SI.Z4.30-35.MI.AP2.FD","OF10510","noch zu übersetzen"]
["SI.Z4.30-35.MI.AP2.FD.WP","OF10511","noch zu übersetzen"]
["SI.Z4.30-35.MI.CO","OF10512","noch zu übersetzen"]
["SI.Z4.30-35.MI.CO.WP","OF10513","noch zu übersetzen"]
["SI.Z4.30-35.MI.CO.WP.MS","OF10514","noch zu übersetzen"]
["SI.Z4.30-35.MI.FD","OF10515","noch zu übersetzen"]
["SI.Z4.30-35.MI.FD.WP","OF10516","noch zu übersetzen"]
["SI.Z4.30-40.M.CO","OF10517","noch zu übersetzen"]
["SI.Z4.30-40.M.CO.WP","OF10518","noch zu übersetzen"]
["SI.Z4.30-40.M.CO.WP.MS","OF10519","noch zu übersetzen"]
["SI.Z4.30-40.MI.AP2.FD","OF10520","noch zu übersetzen"]
["SI.Z4.30-40.MI.CO","OF10521","noch zu übersetzen"]
["SI.Z4.30-40.MI.CO.MS","OF10522","noch zu übersetzen"]
["SI.Z4.30-40.MI.CO.WP","OF10523","noch zu übersetzen"]
["SI.Z4.30-40.MI.FD","OF10524","noch zu übersetzen"]
["SI.Z4.30-45.M.CO","OF10525","noch zu übersetzen"]
["SI.Z4.30-45.MI.AP2.FD","OF10526","noch zu übersetzen"]
["SI.Z4.30-45.MI.CO","OF10527","noch zu übersetzen"]
["SI.Z4.30-50.M.CO","OF10528","noch zu übersetzen"]
["SI.Z4.30-50.MI.CO","OF10529","noch zu übersetzen"]
["SI.Z4.30-50.MI.CO.WP","OF10530","noch zu übersetzen"]
["SI.Z4.30-55.MI.CO","OF10531","noch zu übersetzen"]
["SI.Z4.30-60.M.CO","OF10532","noch zu übersetzen"]
["SI.Z4.30-60.MI.AP2.FD","OF10533","noch zu übersetzen"]
["SI.Z4.30-60.MI.CO","OF10534","noch zu übersetzen"]
["SI.Z4.30-60.MI.CO.WP","OF10535","noch zu übersetzen"]
["SI.Z4.30-65.M.AP2.FD","OF10536","noch zu übersetzen"]
["SI.Z4.30-65.M.CO","OF10537","noch zu übersetzen"]
["SI.Z4.30-65.M.CO.WP","OF10538","noch zu übersetzen"]
["SI.Z4.30-65.MI.AP2.FD","OF10539","noch zu übersetzen"]
["SI.Z4.30-65.MI.AP2.FD.WP","OF10540","noch zu übersetzen"]
["SI.Z4.30-70.M.CO.WP","OF10541",{"$f":"$I$2","v":"noch zu übersetzen"}]
["SI.Z4.30-70.MI.CO","OF10542","noch zu übersetzen"]
["SI.Z4.30-80.MI.CO","OF10543","noch zu übersetzen"]
["SI.Z4.35-10.M.HZ","OF10544","noch zu übersetzen"]
["SI.Z4.35-10.M.HZ.DK","OF10545","noch zu übersetzen"]
["SI.Z4.35-10.M.HZ.MR","OF10546","noch zu übersetzen"]
["SI.Z4.35-10.M.HZ.WP","OF10547","noch zu übersetzen"]
["SI.Z4.35-10.MI.HZ","OF10548","noch zu übersetzen"]
["SI.Z4.35-10.MI.HZ.DK","OF10549","noch zu übersetzen"]
["SI.Z4.35-10.MI.HZ.DK.WP","OF10550","noch zu übersetzen"]
["SI.Z4.35-10.MI.HZ.MR","OF10551","noch zu übersetzen"]
["SI.Z4.35-10.MI.HZ.MR.WP","OF10552","noch zu übersetzen"]
["SI.Z4.35-10.MI.HZ.WP","OF10553","noch zu übersetzen"]
["SI.Z4.35-10.MI.HZ.WP.MS","OF10554","noch zu übersetzen"]
["SI.Z4.35-30.M.AP2.FD","OF10555","noch zu übersetzen"]
["SI.Z4.35-30.M.CO","OF10556","noch zu übersetzen"]
["SI.Z4.35-30.M.CO.MS","OF10557","noch zu übersetzen"]
["SI.Z4.35-30.M.CO.WP","OF10558","noch zu übersetzen"]
["SI.Z4.35-30.M.CO.WP.MS","OF10559","noch zu übersetzen"]
["SI.Z4.35-30.MI.AP2.FD","OF10560","noch zu übersetzen"]
["SI.Z4.35-30.MI.AP2.FD.WP","OF10561","noch zu übersetzen"]
["SI.Z4.35-30.MI.CO","OF10562","noch zu übersetzen"]
["SI.Z4.35-30.MI.CO.MS","OF10563","noch zu übersetzen"]
["SI.Z4.35-30.MI.CO.WP","OF10564","noch zu übersetzen"]
["SI.Z4.35-30.MI.FD","OF10565","noch zu übersetzen"]
["SI.Z4.35-35.M.AP2.FD","OF10566","noch zu übersetzen"]
["SI.Z4.35-35.M.AP2.FD.WP","OF10567","noch zu übersetzen"]
["SI.Z4.35-35.M.CO","OF10568","noch zu übersetzen"]
["SI.Z4.35-35.M.CO.MS","OF10569","noch zu übersetzen"]
["SI.Z4.35-35.M.CO.WP","OF10570","noch zu übersetzen"]
["SI.Z4.35-35.M.CO.WP.MS","OF10571","noch zu übersetzen"]
["SI.Z4.35-35.MI.AP2.BL","OF10572","noch zu übersetzen"]
["SI.Z4.35-35.MI.AP2.BL.SKG","OF10573","noch zu übersetzen"]
["SI.Z4.35-35.MI.AP2.BL.WP","OF10574","noch zu übersetzen"]
["SI.Z4.35-35.MI.AP2.FD","OF10575","noch zu übersetzen"]
["SI.Z4.35-35.MI.AP2.FD.WP","OF10576","noch zu übersetzen"]
["SI.Z4.35-35.MI.CO","OF10577","noch zu übersetzen"]
["SI.Z4.35-35.MI.CO.MS","OF10578","noch zu übersetzen"]
["SI.Z4.35-35.MI.CO.WP","OF10579","noch zu übersetzen"]
["SI.Z4.35-35.MI.FD","OF10580","noch zu übersetzen"]
["SI.Z4.35-35.MI.FD.WP","OF10581","noch zu übersetzen"]
["SI.Z4.35-40.M.AP2.FD","OF10582","noch zu übersetzen"]
["SI.Z4.35-40.M.AP2.FD.WP","OF10583","noch zu übersetzen"]
["SI.Z4.35-40.M.CO","OF10584","noch zu übersetzen"]
["SI.Z4.35-40.M.CO.WP","OF10585","noch zu übersetzen"]
["SI.Z4.35-40.MI.AP2.FD","OF10586","noch zu übersetzen"]
["SI.Z4.35-40.MI.CO","OF10587","noch zu übersetzen"]
["SI.Z4.35-40.MI.CO.WP","OF10588","noch zu übersetzen"]
["SI.Z4.35-40.MI.FD","OF10589","noch zu übersetzen"]
["SI.Z4.35-40.MI.FD.WP","OF10590","noch zu übersetzen"]
["SI.Z4.35-45.M.AP2.FD","OF10591","noch zu übersetzen"]
["SI.Z4.35-45.M.CO","OF10592","noch zu übersetzen"]
["SI.Z4.35-45.M.CO.WP","OF10593","noch zu übersetzen"]
["SI.Z4.35-45.MI.AP2.FD","OF10594","noch zu übersetzen"]
["SI.Z4.35-45.MI.CO","OF10595","noch zu übersetzen"]
["SI.Z4.35-45.MI.CO.WP","OF10596","noch zu übersetzen"]
["SI.Z4.35-45.MI.FD.WP","OF10597","noch zu übersetzen"]
["SI.Z4.35-50.M.AP2.FD","OF10598","noch zu übersetzen"]
["SI.Z4.35-50.M.CO","OF10599","noch zu übersetzen"]
["SI.Z4.35-50.MI.CO","OF10600","noch zu übersetzen"]
["SI.Z4.35-55.M.CO","OF10601","noch zu übersetzen"]
["SI.Z4.35-55.M.CO.WP","OF10602","noch zu übersetzen"]
["SI.Z4.35-55.MI.CO","OF10603","noch zu übersetzen"]
["SI.Z4.35-55.MI.FD","OF10604","noch zu übersetzen"]
["SI.Z4.35-60.M.AP2.FD","OF10605",{"$f":"$I$2","v":"noch zu übersetzen"}]
["SI.Z4.35-60.MI.AP2.FD.WP","OF10606","noch zu übersetzen"]
["SI.Z4.35-60.MI.CO.WP","OF10607","noch zu übersetzen"]
["SI.Z4.35-65.M.AP2.FD.WP","OF10608","noch zu übersetzen"]
["SI.Z4.35-65.MI.AP2.BL.WP","OF10609","noch zu übersetzen"]
["SI.Z4.35-65.MI.AP2.FD","OF10610","noch zu übersetzen"]
["SI.Z4.35-65.MI.AP2.FD.WP","OF10611","noch zu übersetzen"]
["SI.Z4.35-70.MI.AP2.FD.WP","OF10612","noch zu übersetzen"]
["SI.Z4.35-85.MI.CO","OF10613","noch zu übersetzen"]
["SI.Z4.40-10.M.HZ","OF10614","noch zu übersetzen"]
["SI.Z4.40-10.M.HZ.DK","OF10615","noch zu übersetzen"]
["SI.Z4.40-10.M.HZ.DK.WP","OF10616","noch zu übersetzen"]
["SI.Z4.40-10.M.HZ.WP","OF10617","noch zu übersetzen"]
["SI.Z4.40-10.MI.HZ","OF10618","noch zu übersetzen"]
["SI.Z4.40-10.MI.HZ.DK","OF10619","noch zu übersetzen"]
["SI.Z4.40-10.MI.HZ.DK.WP","OF10620","noch zu übersetzen"]
["SI.Z4.40-10.MI.HZ.MR","OF10621","noch zu übersetzen"]
["SI.Z4.40-10.MI.HZ.WP","OF10622","noch zu übersetzen"]
["SI.Z4.40-30.M.AP2.FD","OF10623","noch zu übersetzen"]
["SI.Z4.40-30.M.CO","OF10624","noch zu übersetzen"]
["SI.Z4.40-30.M.CO.WP","OF10625","noch zu übersetzen"]
["SI.Z4.40-30.M.CO.WP.MS","OF10626","noch zu übersetzen"]
["SI.Z4.40-30.MI.AP2.FD","OF10627","noch zu übersetzen"]
["SI.Z4.40-30.MI.AP2.FD.WP","OF10628","noch zu übersetzen"]
["SI.Z4.40-30.MI.CO","OF10629","noch zu übersetzen"]
["SI.Z4.40-30.MI.CO.WP","OF10630","noch zu übersetzen"]
["SI.Z4.40-30.MI.FD","OF10631","noch zu übersetzen"]
["SI.Z4.40-35.M.AP2.FD","OF10632","noch zu übersetzen"]
["SI.Z4.40-35.M.CO","OF10633","noch zu übersetzen"]
["SI.Z4.40-35.M.CO.WP","OF10634","noch zu übersetzen"]
["SI.Z4.40-35.MI.AP2.FD","OF10635","noch zu übersetzen"]
["SI.Z4.40-35.MI.AP2.FD.WP","OF10636","noch zu übersetzen"]
["SI.Z4.40-35.MI.CO","OF10637","noch zu übersetzen"]
["SI.Z4.40-35.MI.CO.WP","OF10638","noch zu übersetzen"]
["SI.Z4.40-35.MI.FD","OF10639","noch zu übersetzen"]
["SI.Z4.40-35.MI.FD.MR","OF10640","noch zu übersetzen"]
["SI.Z4.40-35.MI.FD.WP","OF10641","noch zu übersetzen"]
["SI.Z4.40-40.M.AP2.FD","OF10642","noch zu übersetzen"]
["SI.Z4.40-40.M.AP2.FD.WP","OF10643","noch zu übersetzen"]
["SI.Z4.40-40.M.CO","OF10644","noch zu übersetzen"]
["SI.Z4.40-40.M.CO.WP","OF10645","noch zu übersetzen"]
["SI.Z4.40-40.M.CO.WP.MS","OF10646","noch zu übersetzen"]
["SI.Z4.40-40.MI.AP2.BL","OF10647","noch zu übersetzen"]
["SI.Z4.40-40.MI.AP2.BL.WP","OF10648","noch zu übersetzen"]
["SI.Z4.40-40.MI.AP2.FD","OF10649","noch zu übersetzen"]
["SI.Z4.40-40.MI.AP2.FD.WP","OF10650","noch zu übersetzen"]
["SI.Z4.40-40.MI.CO","OF10651","noch zu übersetzen"]
["SI.Z4.40-40.MI.CO.MS","OF10652","noch zu übersetzen"]
["SI.Z4.40-40.MI.CO.WP","OF10653","noch zu übersetzen"]
["SI.Z4.40-40.MI.FD","OF10654","noch zu übersetzen"]
["SI.Z4.40-40.MI.FD.WP","OF10655","noch zu übersetzen"]
["SI.Z4.40-45.M.AP2.FD","OF10656","noch zu übersetzen"]
["SI.Z4.40-45.M.CO","OF10657","noch zu übersetzen"]
["SI.Z4.40-45.M.CO.WP","OF10658","noch zu übersetzen"]
["SI.Z4.40-45.MI.AP2.FD","OF10659","noch zu übersetzen"]
["SI.Z4.40-45.MI.CO","OF10660","noch zu übersetzen"]
["SI.Z4.40-45.MI.CO.WP","OF10661","noch zu übersetzen"]
["SI.Z4.40-45.MI.FD","OF10662","noch zu übersetzen"]
["SI.Z4.40-50.M.AP2.FD","OF10663","noch zu übersetzen"]
["SI.Z4.40-50.M.CO","OF10664","noch zu übersetzen"]
["SI.Z4.40-50.MI.AP2.BL","OF10665","noch zu übersetzen"]
["SI.Z4.40-50.MI.AP2.FD","OF10666","noch zu übersetzen"]
["SI.Z4.40-50.MI.AP2.FD.WP","OF10667","noch zu übersetzen"]
["SI.Z4.40-50.MI.CO","OF10668","noch zu übersetzen"]
["SI.Z4.40-50.MI.CO.WP","OF10669",{"$f":"$I$2","v":"noch zu übersetzen"}]
["SI.Z4.40-55.MI.AP2.FD","OF10670","noch zu übersetzen"]
["SI.Z4.40-55.MI.CO","OF10671","noch zu übersetzen"]
["SI.Z4.40-60.MI.AP2.FD.WP","OF10672","noch zu übersetzen"]
["SI.Z4.40-60.MI.CO","OF10673","noch zu übersetzen"]
["SI.Z4.40-60.MI.CO.WP","OF10674","noch zu übersetzen"]
["SI.Z4.45-10.M.HZ","OF10675","noch zu übersetzen"]
["SI.Z4.45-10.M.HZ.WP","OF10676","noch zu übersetzen"]
["SI.Z4.45-10.MI.HZ","OF10677","noch zu übersetzen"]
["SI.Z4.45-10.MI.HZ.DK","OF10678","noch zu übersetzen"]
["SI.Z4.45-10.MI.HZ.WP","OF10679","noch zu übersetzen"]
["SI.Z4.45-30.M.AP2.FD.WP","OF10680","noch zu übersetzen"]
["SI.Z4.45-30.M.CO","OF10681","noch zu übersetzen"]
["SI.Z4.45-30.M.CO.WP","OF10682","noch zu übersetzen"]
["SI.Z4.45-30.MI.AP2.FD","OF10683","noch zu übersetzen"]
["SI.Z4.45-30.MI.CO","OF10684","noch zu übersetzen"]
["SI.Z4.45-30.MI.CO.WP","OF10685","noch zu übersetzen"]
["SI.Z4.45-35.M.CO","OF10686","noch zu übersetzen"]
["SI.Z4.45-35.M.CO.WP","OF10687","noch zu übersetzen"]
["SI.Z4.45-35.MI.AP2.BL.WP","OF10688","noch zu übersetzen"]
["SI.Z4.45-35.MI.AP2.FD","OF10689","noch zu übersetzen"]
["SI.Z4.45-35.MI.AP2.FD.WP","OF10690","noch zu übersetzen"]
["SI.Z4.45-35.MI.CO","OF10691","noch zu übersetzen"]
["SI.Z4.45-35.MI.CO.WP","OF10692","noch zu übersetzen"]
["SI.Z4.45-35.MI.FD","OF10693","noch zu übersetzen"]
["SI.Z4.45-40.M.AP2.FD","OF10694","noch zu übersetzen"]
["SI.Z4.45-40.M.CO","OF10695","noch zu übersetzen"]
["SI.Z4.45-40.M.CO.WP","OF10696","noch zu übersetzen"]
["SI.Z4.45-40.MI.AP2.FD","OF10697","noch zu übersetzen"]
["SI.Z4.45-40.MI.AP2.FD.WP","OF10698","noch zu übersetzen"]
["SI.Z4.45-40.MI.CO","OF10699","noch zu übersetzen"]
["SI.Z4.45-40.MI.CO.WP","OF10700","noch zu übersetzen"]
["SI.Z4.45-40.MI.FD","OF10701","noch zu übersetzen"]
["SI.Z4.45-40.MI.FD.WP","OF10702","noch zu übersetzen"]
["SI.Z4.45-45.M.AP2.FD","OF10703","noch zu übersetzen"]
["SI.Z4.45-45.M.AP2.FD.WP","OF10704","noch zu übersetzen"]
["SI.Z4.45-45.M.CO","OF10705","noch zu übersetzen"]
["SI.Z4.45-45.M.CO.WP","OF10706","noch zu übersetzen"]
["SI.Z4.45-45.MI.AP2.BL","OF10707","noch zu übersetzen"]
["SI.Z4.45-45.MI.AP2.BL.WP","OF10708","noch zu übersetzen"]
["SI.Z4.45-45.MI.AP2.FD","OF10709","noch zu übersetzen"]
["SI.Z4.45-45.MI.AP2.FD.WP","OF10710","noch zu übersetzen"]
["SI.Z4.45-45.MI.CO","OF10711","noch zu übersetzen"]
["SI.Z4.45-45.MI.CO.WP","OF10712","noch zu übersetzen"]
["SI.Z4.45-45.MI.FD","OF10713","noch zu übersetzen"]
["SI.Z4.45-50.M.CO","OF10714","noch zu übersetzen"]
["SI.Z4.45-50.M.CO.WP","OF10715","noch zu übersetzen"]
["SI.Z4.45-50.MI.AP2.BL","OF10716","noch zu übersetzen"]
["SI.Z4.45-50.MI.AP2.FD.WP","OF10717","noch zu übersetzen"]
["SI.Z4.45-50.MI.CO","OF10718","noch zu übersetzen"]
["SI.Z4.45-50.MI.CO.WP","OF10719","noch zu übersetzen"]
["SI.Z4.45-60.MI.CO.WP","OF10720","noch zu übersetzen"]
["SI.Z4.45-65.M.CO.WP","OF10721","noch zu übersetzen"]
["SI.Z4.45-70.MI.AP2.FD","OF10722","noch zu übersetzen"]
["SI.Z4.45-70.MI.CO","OF10723","noch zu übersetzen"]
["SI.Z4.50-10.M.HZ","OF10724","noch zu übersetzen"]
["SI.Z4.50-10.MI.HZ","OF10725","noch zu übersetzen"]
["SI.Z4.50-10.MI.HZ.DK.WP","OF10726","noch zu übersetzen"]
["SI.Z4.50-10.MI.HZ.MR.WP","OF10727","noch zu übersetzen"]
["SI.Z4.50-10.MI.HZ.WP","OF10728","noch zu übersetzen"]
["SI.Z4.50-30.M.AP2.FD.WP","OF10729","noch zu übersetzen"]
["SI.Z4.50-30.M.CO","OF10730","noch zu übersetzen"]
["SI.Z4.50-30.M.CO.MS","OF10731","noch zu übersetzen"]
["SI.Z4.50-30.M.CO.WP","OF10732","noch zu übersetzen"]
["SI.Z4.50-30.MI.AP2.BL.WP","OF10733",{"$f":"$I$2","v":"noch zu übersetzen"}]
["SI.Z4.50-30.MI.AP2.FD","OF10734","noch zu übersetzen"]
["SI.Z4.50-30.MI.CO","OF10735","noch zu übersetzen"]
["SI.Z4.50-30.MI.CO.WP","OF10736","noch zu übersetzen"]
["SI.Z4.50-30.MI.FD","OF10737","noch zu übersetzen"]
["SI.Z4.50-35.M.AP2.FD.WP","OF10738","noch zu übersetzen"]
["SI.Z4.50-35.M.CO","OF10739","noch zu übersetzen"]
["SI.Z4.50-35.M.CO.MS","OF10740","noch zu übersetzen"]
["SI.Z4.50-35.M.CO.WP","OF10741","noch zu übersetzen"]
["SI.Z4.50-35.MI.AP2.BL.WP","OF10742","noch zu übersetzen"]
["SI.Z4.50-35.MI.AP2.FD","OF10743","noch zu übersetzen"]
["SI.Z4.50-35.MI.AP2.FD.WP","OF10744","noch zu übersetzen"]
["SI.Z4.50-35.MI.CO","OF10745","noch zu übersetzen"]
["SI.Z4.50-35.MI.CO.WP","OF10746","noch zu übersetzen"]
["SI.Z4.50-40.M.AP2.FD","OF10747","noch zu übersetzen"]
["SI.Z4.50-40.M.CO.WP","OF10748","noch zu übersetzen"]
["SI.Z4.50-40.M.CO.WP.MS","OF10749","noch zu übersetzen"]
["SI.Z4.50-40.MI.CO","OF10750","noch zu übersetzen"]
["SI.Z4.50-40.MI.CO.WP","OF10751","noch zu übersetzen"]
["SI.Z4.50-45.M.CO.WP","OF10752","noch zu übersetzen"]
["SI.Z4.50-45.MI.AP2.FD.WP","OF10753","noch zu übersetzen"]
["SI.Z4.50-45.MI.CO","OF10754","noch zu übersetzen"]
["SI.Z4.50-45.MI.CO.WP","OF10755","noch zu übersetzen"]
["SI.Z4.50-50.M.AP2.FD","OF10756","noch zu übersetzen"]
["SI.Z4.50-50.M.CO","OF10757","noch zu übersetzen"]
["SI.Z4.50-50.M.CO.WP","OF10758","noch zu übersetzen"]
["SI.Z4.50-50.MI.AP2.BL.WP","OF10759","noch zu übersetzen"]
["SI.Z4.50-50.MI.AP2.FD","OF10760","noch zu übersetzen"]
["SI.Z4.50-50.MI.AP2.FD.WP","OF10761","noch zu übersetzen"]
["SI.Z4.50-50.MI.CO","OF10762","noch zu übersetzen"]
["SI.Z4.50-50.MI.CO.WP","OF10763","noch zu übersetzen"]
["SI.Z4.50-50.MI.FD.WP","OF10764","noch zu übersetzen"]
["SI.Z4.50-55.M.AP2.FD.WP","OF10765","noch zu übersetzen"]
["SI.Z4.50-55.MI.AP2.FD.WP","OF10766","noch zu übersetzen"]
["SI.Z4.50-70.MI.CO","OF10767","noch zu übersetzen"]
["SI.Z4.55-10.M.HZ.WP","OF10768","noch zu übersetzen"]
["SI.Z4.55-10.MI.HZ.WP","OF10769","noch zu übersetzen"]
["SI.Z4.55-30.M.AP2.FD.WP","OF10770","noch zu übersetzen"]
["SI.Z4.55-30.M.CO.WP","OF10771","noch zu übersetzen"]
["SI.Z4.55-30.MI.AP2.FD.WP","OF10772","noch zu übersetzen"]
["SI.Z4.55-30.MI.CO","OF10773","noch zu übersetzen"]
["SI.Z4.55-30.MI.CO.WP","OF10774","noch zu übersetzen"]
["SI.Z4.55-35.M.AP2.FD","OF10775","noch zu übersetzen"]
["SI.Z4.55-35.M.CO","OF10776","noch zu übersetzen"]
["SI.Z4.55-35.M.CO.WP","OF10777","noch zu übersetzen"]
["SI.Z4.55-35.MI.AP2.FD.WP","OF10778","noch zu übersetzen"]
["SI.Z4.55-35.MI.CO","OF10779","noch zu übersetzen"]
["SI.Z4.55-35.MI.CO.WP","OF10780","noch zu übersetzen"]
["SI.Z4.55-35.MI.FD","OF10781","noch zu übersetzen"]
["SI.Z4.55-40.M.CO.WP","OF10782","noch zu übersetzen"]
["SI.Z4.55-40.MI.CO","OF10783","noch zu übersetzen"]
["SI.Z4.55-40.MI.CO.WP","OF10784","noch zu übersetzen"]
["SI.Z4.55-45.M.CO","OF10785","noch zu übersetzen"]
["SI.Z4.55-45.M.CO.WP","OF10786","noch zu übersetzen"]
["SI.Z4.55-45.MI.CO","OF10787","noch zu übersetzen"]
["SI.Z4.55-50.M.AP2.FD.WP","OF10788","noch zu übersetzen"]
["SI.Z4.55-50.MI.CO","OF10789","noch zu übersetzen"]
["SI.Z4.55-50.MI.CO.WP","OF10790","noch zu übersetzen"]
["SI.Z4.55-55.M.AP2.FD.WP","OF10791","noch zu übersetzen"]
["SI.Z4.55-55.M.CO.WP","OF10792","noch zu übersetzen"]
["SI.Z4.55-70.MI.AP2.FD","OF10793","noch zu übersetzen"]
["SI.Z4.55-70.MI.AP2.FD.WP","OF10794","noch zu übersetzen"]
["SI.Z4.60-10.M.HZ","OF10795","noch zu übersetzen"]
["SI.Z4.60-10.MI.HZ","OF10796","noch zu übersetzen"]
["SI.Z4.60-10.MI.HZ.DK","OF10797",{"$f":"$I$2","v":"noch zu übersetzen"}]
["SI.Z4.60-10.MI.HZ.DK.WP","OF10798","noch zu übersetzen"]
["SI.Z4.60-10.MI.HZ.WP","OF10799","noch zu übersetzen"]
["SI.Z4.60-30.M.AP2.FD.WP","OF10800","noch zu übersetzen"]
["SI.Z4.60-30.M.CO","OF10801","noch zu übersetzen"]
["SI.Z4.60-30.M.CO.WP","OF10802","noch zu übersetzen"]
["SI.Z4.60-30.MI.AP2.FD","OF10803","noch zu übersetzen"]
["SI.Z4.60-30.MI.AP2.FD.WP","OF10804","noch zu übersetzen"]
["SI.Z4.60-30.MI.CO","OF10805","noch zu übersetzen"]
["SI.Z4.60-30.MI.CO.WP","OF10806","noch zu übersetzen"]
["SI.Z4.60-35.M.AP2.FD.WP","OF10807","noch zu übersetzen"]
["SI.Z4.60-35.M.CO.WP","OF10808","noch zu übersetzen"]
["SI.Z4.60-35.MI.AP2.FD.WP","OF10809","noch zu übersetzen"]
["SI.Z4.60-35.MI.CO","OF10810","noch zu übersetzen"]
["SI.Z4.60-35.MI.CO.WP","OF10811","noch zu übersetzen"]
["SI.Z4.60-35.MI.FD.WP","OF10812","noch zu übersetzen"]
["SI.Z4.60-40.M.AP2.FD","OF10813","noch zu übersetzen"]
["SI.Z4.60-40.M.CO","OF10814","noch zu übersetzen"]
["SI.Z4.60-40.MI.CO","OF10815","noch zu übersetzen"]
["SI.Z4.60-40.MI.CO.WP","OF10816","noch zu übersetzen"]
["SI.Z4.60-45.MI.CO.WP","OF10817","noch zu übersetzen"]
["SI.Z4.60-60.M.AP2.FD.WP","OF10818","noch zu übersetzen"]
["SI.Z4.60-65.MI.CO.WP","OF10819","noch zu übersetzen"]
["SI.Z4.65-10.MI.HZ.WP","OF10820","noch zu übersetzen"]
["SI.Z4.65-30.M.CO","OF10821","noch zu übersetzen"]
["SI.Z4.65-30.MI.AP2.BL.WP","OF10822","noch zu übersetzen"]
["SI.Z4.65-30.MI.AP2.FD","OF10823","noch zu übersetzen"]
["SI.Z4.65-30.MI.CO","OF10824","noch zu übersetzen"]
["SI.Z4.65-35.M.AP2.FD","OF10825","noch zu übersetzen"]
["SI.Z4.65-35.M.AP2.FD.WP","OF10826","noch zu übersetzen"]
["SI.Z4.65-35.M.CO","OF10827","noch zu übersetzen"]
["SI.Z4.65-35.M.CO.WP","OF10828","noch zu übersetzen"]
["SI.Z4.65-35.M.FD.MR.WP","OF10829","noch zu übersetzen"]
["SI.Z4.65-35.MI.AP2.BL.WP","OF10830","noch zu übersetzen"]
["SI.Z4.65-35.MI.AP2.FD","OF10831","noch zu übersetzen"]
["SI.Z4.65-35.MI.CO","OF10832","noch zu übersetzen"]
["SI.Z4.65-35.MI.CO.WP","OF10833","noch zu übersetzen"]
["SI.Z4.65-40.MI.CO","OF10834","noch zu übersetzen"]
["SI.Z4.65-45.M.CO","OF10835","noch zu übersetzen"]
["SI.Z4.65-45.MI.CO","OF10836","noch zu übersetzen"]
["SI.Z4.65-45.MI.CO.WP","OF10837","noch zu übersetzen"]
["SI.Z4.65-50.MI.AP2.FD","OF10838","noch zu übersetzen"]
["SI.Z4.65-50.MI.CO","OF10839","noch zu übersetzen"]
["SI.Z4.65-50.MI.CO.WP","OF10840","noch zu übersetzen"]
["SI.Z4.65-80.M.CO","OF10841","noch zu übersetzen"]
["SI.Z4.70-10.MI.HZ.WP","OF10842","noch zu übersetzen"]
["SI.Z4.70-30.M.CO.WP","OF10843","noch zu übersetzen"]
["SI.Z4.70-30.M.CO.WP.MS","OF10844","noch zu übersetzen"]
["SI.Z4.70-30.MI.CO","OF10845","noch zu übersetzen"]
["SI.Z4.70-30.MI.CO.WP","OF10846","noch zu übersetzen"]
["SI.Z4.70-35.MI.AP2.FD.WP","OF10847","noch zu übersetzen"]
["SI.Z4.70-35.MI.CO","OF10848","noch zu übersetzen"]
["SI.Z4.70-35.MI.CO.WP","OF10849","noch zu übersetzen"]
["SI.Z4.70-35.MI.FD.WP","OF10850","noch zu übersetzen"]
["SI.Z4.70-40.M.CO","OF10851","noch zu übersetzen"]
["SI.Z4.70-40.MI.CO","OF10852","noch zu übersetzen"]
["SI.Z4.70-50.MI.CO","OF10853","noch zu übersetzen"]
["SI.Z4.70-60.MI.CO","OF10854","noch zu übersetzen"]
["SI.Z4.70-65.M.CO","OF10855","noch zu übersetzen"]
["SI.Z4.75-30.MI.CO.WP","OF10856","noch zu übersetzen"]
["SI.Z4.75-35.M.AP2.FD.WP","OF10857","noch zu übersetzen"]
["SI.Z4.75-45.M.AP2.FD.WP","OF10858","noch zu übersetzen"]
["SI.Z4.75-45.M.CO.WP","OF10859","noch zu übersetzen"]
["SI.Z4.80-10.M.HZ","OF10860","noch zu übersetzen"]
["SI.Z4.80-45.M.CO","OF10861",{"$f":"$I$2","v":"noch zu übersetzen"}]
["SI.Z4.85-30.MI.CO.WP","OF10862","noch zu übersetzen"]
["SI.Z4.85-40.MI.CO.WP","OF10863","noch zu übersetzen"]
["SI.Z4.85-45.MI.CO","OF10864","noch zu übersetzen"]
["SI.Z4.90-35.MI.CO","OF10865","noch zu übersetzen"]
["SI.Z4.PL.08.25.M.ML.WP","OF10866","noch zu übersetzen"]
["SI.Z4.PL.08.25.M.SL.WP","OF10867","noch zu übersetzen"]
["SI.Z4.PL.08.25.MI.ML.WP","OF10868","noch zu übersetzen"]
["SI.Z4.PL.08.25.MI.SL.WP","OF10869","noch zu übersetzen"]
["SI.Z4.PL.08.60.M.ML.WP","OF10870","noch zu übersetzen"]
["SI.Z4.PL.08.60.M.ML.WP.G2","OF10871","noch zu übersetzen"]
["SI.Z4.PL.08.60.M.SL.WP","OF10872","noch zu übersetzen"]
["SI.Z4.PL.08.60.MI.ML.WP","OF10873","noch zu übersetzen"]
["SI.Z4.PL.08.60.MI.SL.WP","OF10874","noch zu übersetzen"]
["SI.Z4.PL.11.35.M.ML.WP","OF10875","noch zu übersetzen"]
["SI.Z4.PL.11.35.M.SL.WP","OF10876","noch zu übersetzen"]
["SI.Z4.PL.11.35.MI.ML.WP","OF10877","noch zu übersetzen"]
["SI.Z4.PL.11.35.MI.SL.WP","OF10878","noch zu übersetzen"]
["SI.Z4.PL.11.50.M.ML.WP","OF10879","noch zu übersetzen"]
["SI.Z4.PL.11.50.M.SL.WP","OF10880","noch zu übersetzen"]
["SI.Z4.PL.11.50.MI.ML.WP","OF10881","noch zu übersetzen"]
["SI.Z4.PL.11.50.MI.SL.WP","OF10882","noch zu übersetzen"]
["SI.Z4.RS.A40.MI","OF10883","noch zu übersetzen"]
["SI.Z4.RS.A40.MI.WP","OF10884","noch zu übersetzen"]
["SI.Z4.SO.A40.MI","OF10885","noch zu übersetzen"]
["SI.Z4.SO.A40.MI.WP","OF10886","noch zu übersetzen"]
["SI.Z4.SO.I30","OF10887","noch zu übersetzen"]
["SI.Z4.SR.30-10.MI.HZ","OF10888","noch zu übersetzen"]
["SI.Z4.SR.30-30.MI.CO","OF10889","noch zu übersetzen"]
["SI.Z4.SR.30-50.MI.CO","OF10890","noch zu übersetzen"]
["SI.Z4.SR.35-10.M.HZ","OF10891","noch zu übersetzen"]
["SI.Z4.SR.35-40.MI.CO","OF10892","noch zu übersetzen"]
["SI.Z4.SR.35-55.MI.CO","OF10893","noch zu übersetzen"]
["SI.Z4.SR.40-30.MI.CO","OF10894","noch zu übersetzen"]
["SI.Z4.SR.40-40.MI.CO","OF10895","noch zu übersetzen"]
["SI.Z4.SR.40-45.MI.CO","OF10896","noch zu übersetzen"]
["SI.Z4.SR.40-60.MI.CO","OF10897","noch zu übersetzen"]
["SI.Z4.SR.45-30.MI.CO","OF10898","noch zu übersetzen"]
["SI.Z4.SR.45-35.MI.CO","OF10899","noch zu übersetzen"]
["SI.Z4.SR.50-30.MI.CO","OF10900","noch zu übersetzen"]
["SI.Z4.SR.50-65.MI.CO","OF10901","noch zu übersetzen"]
["SI.Z4.SR.55-70.MI.CO","OF10902",{"$f":"$I$2","v":"noch zu übersetzen"}]
["SI.Z4.SR.70-55.MI.CO","OF10903","noch zu übersetzen"]
["SI.SHAM07A721AA1A","OF35329",{"$f":"$I$1","v":"Smarthandle"}]
["SI.SHAS08A851AA3A","OF35330","Smarthandle"]
["SI.SHAL08A721BB1A","OF35331","Smarthandle"]
["SI.SHAS09B721CC13","OF35334","Smarthandle"]
["SI.SHAS09B722CC1A","OF35341","Smarthandle"]
["SI.SHCS09K001AA1A","OF35348","Smarthandle"]
["SI.Z4.60-75.MI.CO","OF35360",{"$f":"$I$2","v":"noch zu übersetzen"}]
["SI.SHAMF8B921AA1A","OF35373",{"$f":"$I$1","v":"Smarthandle"}]
["SI.SHAM09B921AA1A","OF35374","Smarthandle"]
["SI.SHAS09B751BB1AWP","OF35378","Smarthandle"]
["SI.SHAS08B901BB3AWP","OF35379","Smarthandle"]
["SI.SHAS08B901BB3A","OF35382","Smarthandle"]
["SI.SHLSF8E901CC1A","OF35433","Smarthandle"]
["SI.Z4.35-50.MI.CO.WP","OF35455",{"$f":"$I$2","v":"noch zu übersetzen"}]
["SI.SHAS09B751CC1A","OF35466",{"$f":"$I$1","v":"Smarthandle"}]
["SI.SHAM08A851AA1AWP","OF35477","Smarthandle"]
["SI.SHAM09A921DD13","OF35486","Smarthandle"]
["SI.SHCS08F721DD1AWP","OF35488","Smarthandle"]
["SI.Z4.30-60.MI.AP2.FD.WP","OF35489",{"$f":"$I$2","v":"noch zu übersetzen"}]
["SI.Z4.50-40.MI.AP2.FD","OF35490",{"$f":"$I$2","v":"noch zu übersetzen"}]
["SI.Z4.90-30.MI.AP2.FD.WP","OF35491",{"$f":"$I$2","v":"noch zu übersetzen"}]
["SI.SHAS08A921BB1AWP","OF35502",{"$f":"$I$1","v":"Smarthandle"}]
["SI.Z4.60-35.MI.AP2.BL.WP","OF35503",{"$f":"$I$2","v":"noch zu übersetzen"}]
["SI.Z4.55-30.MI.AP2.BL.WP","OF35515","noch zu übersetzen"]
["SI.Z4.45-35.MI.CO.MS","OF35516","noch zu übersetzen"]
["SI.Z4.50-40.MI.AP2.FD.WP","OF35527","noch zu übersetzen"]
["SI.SHCS07E721DD1A","OF35568",{"$f":"$I$1","v":"Smarthandle"}]
["SI.Z4.55-10.M.HZ","OF35569",{"$f":"$I$2","v":"noch zu übersetzen"}]
["SI.SHEM08F051AA3A","OF35575",{"$f":"$I$1","v":"Smarthandle"}]
["SI.Z4.SO.A40.MI.WP.MS","OF35612",{"$f":"$I$2","v":"noch zu übersetzen"}]
["SI.SHCS08G721CC13","OF35653",{"$f":"$I$1","v":"Smarthandle"}]
["SI.SHAS09A902DD1AWP","OF35657","Smarthandle"]
["SI.SHAS08B722AA1A","OF35690","Smarthandle"]
["SI.SHAS08A921BB1A","OF35700","Smarthandle"]
["SI.SHAS08B881BB3AWP","OF35705","Smarthandle"]
["SI.SHCS08F721BB13","OF35708","Smarthandle"]
["SI.SHCL10F921BB13WP","OF35709","Smarthandle"]
["SI.SHAS08A781BB3AWP","OF35710","Smarthandle"]
["SI.Z4.75-10.M.HZ.WP","OF35719",{"$f":"$I$2","v":"noch zu übersetzen"}]
["SI.SHAS09C001BB1A","OF35730",{"$f":"$I$1","v":"Smarthandle"}]
["SI.Z4.70-10.M.HZ.WP","OF35732",{"$f":"$I$2","v":"noch zu übersetzen"}]
["SI.SHAS08C001BB1A","OF35733",{"$f":"$I$1","v":"Smarthandle"}]
["SI.SHCS09E921CC1AWP","OF35736","Smarthandle"]
["SI.SHCS09F721CC1AWP","OF35737","Smarthandle"]
["SI.SHCM09E921CC1AWP","OF35739","Smarthandle"]
["SI.SHAS08A881BB1AWP","OF35741","Smarthandle"]
["SI.SHCS08L001BB13","OF35743","Smarthandle"]
["SI.SHEM08H051BB1A","OF35744","Smarthandle"]
["SI.SHAS08A921CC13WP","OF35745","Smarthandle"]
["SI.SHAM08A921CC13WP","OF35758","Smarthandle"]
["SI.SHAS08A901CC13","OF35759","Smarthandle"]
["SI.SHCL10L001BB13WP","OF35760","Smarthandle"]
["SI.SHDS08F741BB1A","OF35762","Smarthandle"]
["SI.SHAM08C001AA1AWP","OF35763","Smarthandle"]
["SI.SHCS08E721EE1AWP","OF35770","Smarthandle"]
["SI.SHAM08C001CC1A","OF35773","Smarthandle"]
["SI.SHFS09F881CC1A","OF35784","Smarthandle"]
["SI.SHAS08D001CC1A","OF35787","Smarthandle"]
["SI.Z4.35-75.MI.CO.WP","OF35789",{"$f":"$I$2","v":"noch zu übersetzen"}]
["SI.SHCS07F721BB1AWP","OF35806",{"$f":"$I$1","v":"Smarthandle"}]
["SI.SHCS08F721BB1AWP","OF35807","Smarthandle"]
["SI.SHCS08F921BB1AWP","OF35808","Smarthandle"]
["SI.SHAL09A921CC13","OF35824","Smarthandle"]
["SI.SHDM08F741BB1A","OF35828","Smarthandle"]
["SI.SHHL09K001CC1A","OF35836","Smarthandle"]
["SI.SHCM09E921CC1A","OF35837","Smarthandle"]
["SI.SHAS08D001CE1A","OF35876","Smarthandle"]
["SI.Z4.30-10.MI.HZ.MR.WP","OF35921",{"$f":"$I$2","v":"noch zu übersetzen"}]
["SI.SHAM09B722AA1A","OF35947",{"$f":"$I$1","v":"Smarthandle"}]
["SI.SHAM09B722CC1A","OF35948","Smarthandle"]
["SI.SHAM09B752AA1A","OF35949","Smarthandle"]
["SI.SHAM09B902CC1A","OF35950","Smarthandle"]
["SI.SHAM09B921EE13","OF35951","Smarthandle"]
["SI.SHAM09B922CC1A","OF35952","Smarthandle"]
["SI.SHAM09B922CC1AWP","OF35953","Smarthandle"]
["SI.SHAM09B922EE1A","OF35954","Smarthandle"]
["SI.SHAS09B722AA1A","OF35955","Smarthandle"]
["SI.SHAS09B751CC13","OF35956","Smarthandle"]
["SI.SHAS09B752AA1A","OF35957","Smarthandle"]
["SI.SHAS09B752CC1A","OF35958","Smarthandle"]
["SI.SHAS09B781CC13","OF35959","Smarthandle"]
["SI.SHAS09B902AA1AWP","OF35960","Smarthandle"]
["SI.SHAS09B922AA1AWP","OF35961","Smarthandle"]
["SI.SHAS09B922AA1A","OF35962","Smarthandle"]
["SI.SHAS09B922CC1A","OF35963","Smarthandle"]
["SI.Z4.40-50.M.CO.WP","OF35964",{"$f":"$I$2","v":"noch zu übersetzen"}]
["SI.Z4.75-35.MI.CO.WP","OF35996","noch zu übersetzen"]
["SI.Z4.30-10.MI.HZ.MS","OF36019","noch zu übersetzen"]
["SI.SHAL09A901CC13","OF36027",{"$f":"$I$1","v":"Smarthandle"}]
["SI.Z4.75-40.MI.CO.WP","OF36028",{"$f":"$I$2","v":"noch zu übersetzen"}]
["SI.SHAS08A721AA3A","OF36029",{"$f":"$I$1","v":"Smarthandle"}]
["SI.SHCSF8K001AA1A","OF36044","Smarthandle"]
["SI.Z4.35-50.M.CO.WP","OF36132",{"$f":"$I$2","v":"noch zu übersetzen"}]
["SI.Z4.70-50.MI.CO.WP","OF36133","noch zu übersetzen"]
["SI.SHBS08C051BB13","OF36145",{"$f":"$I$1","v":"Smarthandle"}]
["SI.SHBS08C051AA13","OF36146","Smarthandle"]
["SI.SHBM08C051AA13","OF36147","Smarthandle"]
["SI.SHES08G051AA13","OF36148","Smarthandle"]
["SI.SHES08H051AA13","OF36149","Smarthandle"]
["SI.Z4.40-45.MI.FD.WP","OF36162",{"$f":"$I$2","v":"noch zu übersetzen"}]
["SI.SHAM09A751CC13","OF36175",{"$f":"$I$1","v":"Smarthandle"}]
["SI.SHAM09B751CC13","OF36176","Smarthandle"]
["SI.SHAM09A921CC13","OF36201","Smarthandle"]
["SI.Z4.30-65.MI.CO","OF36205",{"$f":"$I$2","v":"noch zu übersetzen"}]
["SI.SHFSF8F901CC1A","OF36272",{"$f":"$I$1","v":"Smarthandle"}]
["SI.SHAMF8C001CC1A","OF36290","Smarthandle"]
["SI.SHAL09B722CC1A","OF36293","Smarthandle"]
["SI.SHAM09B752CC1A","OF36294","Smarthandle"]
["SI.SHAS09B702CC1A","OF36297","Smarthandle"]
["SI.SHAM09A721EE13","OF36298","Smarthandle"]
["SI.SHAS09B721AA13","OF36300","Smarthandle"]
["SI.Z4.65-30.MI.CO.WP","OF36304",{"$f":"$I$2","v":"noch zu übersetzen"}]
["SI.Z4.30-70.MI.CO.WP","OF36305",{"$f":"$I$2","v":"noch zu übersetzen"}]
["SI.SHCS08E851CC1AWP","OF36306",{"$f":"$I$1","v":"Smarthandle"}]
["SI.Z4.45-35.MI.AP2.BL","OF36308",{"$f":"$I$2","v":"noch zu übersetzen"}]
["SI.Z4.30-45.MI.AP2.BL","OF36315","noch zu übersetzen"]
["SI.SHAMF8B881FF1A","OF36317",{"$f":"$I$1","v":"Smarthandle"}]
["SI.SHCM09F921FF1A","OF36318","Smarthandle"]
["SI.SHCS08F781FF1A","OF36319","Smarthandle"]
["SI.SHCS08F881FF1A","OF36320","Smarthandle"]
["SI.Z4.50-50.MI.FD","OF36332",{"$f":"$I$2","v":"noch zu übersetzen"}]
["SI.SHCS07F721BB1A","OF36359",{"$f":"$I$1","v":"Smarthandle"}]
["SI.Z4.60-50.MI.CO.WP","OF36365",{"$f":"$I$2","v":"noch zu übersetzen"}]
["SI.Z4.40-60.M.AP2.FD.WP","OF36386","noch zu übersetzen"]
["SI.SHCM08F921CD1AWP","OF36414",{"$f":"$I$1","v":"Smarthandle"}]
["SI.Z4.80-50.M.CO.WP","OF36429",{"$f":"$I$2","v":"noch zu übersetzen"}]
["SI.SHCS08E901FF1A","OF36430",{"$f":"$I$1","v":"Smarthandle"}]
["SI.SHAS09B722BB1A","OF36434","Smarthandle"]
["SI.SHAL09A721BB1A","OF36447","Smarthandle"]
["SI.SHASF8B781CC13","OF36449","Smarthandle"]
["SI.SHAS09A751CC13","OF36450","Smarthandle"]
["SI.SHCS08E751CC1AWP","OF36457","Smarthandle"]
["SI.MOCKUP.SH.A.DM","OF3648",{"$f":"$I$1","v":"Smarthandle"}]
["SI.Z4.35-55.MI.CO.WP","OF36482",{"$f":"$I$2","v":"noch zu übersetzen"}]
["SI.MOCKUP.SH.VCN","OF3649",{"$f":"$I$1","v":"Smarthandle"}]
["SI.Z4.45-35.M.AP2.FD","OF36507",{"$f":"$I$2","v":"noch zu übersetzen"}]
["SI.Z4.70-45.MI.CO.WP","OF36520","noch zu übersetzen"]
["SI.SHAS09A721AA1AWP","OF36521",{"$f":"$I$1","v":"Smarthandle"}]
["SI.Z4.35-70.MI.CO.WP","OF36570",{"$f":"$I$2","v":"noch zu übersetzen"}]
["SI.SHAS09A922CC1A","OF36608",{"$f":"$I$1","v":"Smarthandle"}]
["SI.Z4.40-90.MI.CO","OF36643",{"$f":"$I$2","v":"noch zu übersetzen"}]
["SI.SHAS07A701CC13","OF36653",{"$f":"$I$1","v":"Smarthandle"}]
["SI.Z4.75-10.MI.HZ","OF36658",{"$f":"$I$2","v":"noch zu übersetzen"}]
["SI.SHASF8A721BB1A","OF36670",{"$f":"$I$1","v":"Smarthandle"}]
["SI.SHASF8B721BB1A","OF36671","Smarthandle"]
["SI.Z4.40-80.MI.CO.WP","OF36672",{"$f":"$I$2","v":"noch zu übersetzen"}]
["SI.SHCS08E724AA1A","OF36679",{"$f":"$I$1","v":"Smarthandle"}]
["SI.SHCS09E724AA1A","OF36683","Smarthandle"]
["SI.SHCM09E904AA1A","OF36684","Smarthandle"]
["SI.Z4.50-55.MI.CO.WP","OF36690",{"$f":"$I$2","v":"noch zu übersetzen"}]
["SI.Z4.45-65.MI.CO.WP","OF36691","noch zu übersetzen"]
["SI.Z4.50-60.MI.CO.WP","OF36693","noch zu übersetzen"]
["SI.Z4.55-55.MI.CO.WP","OF36705","noch zu übersetzen"]
["SI.SHBS08C054AA1A","OF36707",{"$f":"$I$1","v":"Smarthandle"}]
["SI.SHCS08F921DD1A","OF36750","Smarthandle"]
["SI.SHAL08C001AA1AWP","OF36788","Smarthandle"]
["SI.SHCS09H721CC1A","OF36802","Smarthandle"]
["SI.SHCM09E901AA1A","OF36804","Smarthandle"]
["SI.SHCM09H721CC1A","OF36808","Smarthandle"]
["SI.SHCS09H721CC1AWP","OF36809","Smarthandle"]
["SI.SHCM09H721CC1AWP","OF36810","Smarthandle"]
["SI.Z4.30-50.MI.AP2.FD","OF36811",{"$f":"$I$2","v":"noch zu übersetzen"}]
["SI.Z4.50-45.MI.AP2.FD","OF36812","noch zu übersetzen"]
["SI.Z4.40-50.MI.FD.WP","OF36816","noch zu übersetzen"]
["SI.SHCS08E854AA1AWP","OF36819",{"$f":"$I$1","v":"Smarthandle"}]
["SI.SHAS08A721GG13","OF36823","Smarthandle"]
["SI.SHAM09B721GG13","OF36824","Smarthandle"]
["SI.SHAS09B721GG13","OF36825","Smarthandle"]
["SI.SHCS08F721AA1A","OF36826","Smarthandle"]
["SI.SHCM07K001AA1A","OF36841","Smarthandle"]
["SI.SHAS08A881FF1A","OF36904","Smarthandle"]
["SI.SHCL08F721FF1AWP","OF36905","Smarthandle"]
["SI.SHAS08B781CC1A","OF36912","Smarthandle"]
["SI.Z4.55-45.MI.CO.WP","OF36928",{"$f":"$I$2","v":"noch zu übersetzen"}]
["SI.Z4.30-35.MI.AP2.BL","OF36931","noch zu übersetzen"]
["SI.Z4.70-45.M.CO.WP","OF36970","noch zu übersetzen"]
["SI.SHAM08A921AA1AWP","OF36974",{"$f":"$I$1","v":"Smarthandle"}]
["SI.Z4.60-70.MI.AP2.FD","OF36989",{"$f":"$I$2","v":"noch zu übersetzen"}]
["SI.SHASF8B851AA1A","OF36996",{"$f":"$I$1","v":"Smarthandle"}]
["SI.SHCM08E781FF1AWP","OF37036","Smarthandle"]
["SI.SHCM09E921FF1AWP","OF37037","Smarthandle"]
["SI.SHHM09K001CC1A","OF37039","Smarthandle"]
["SI.SHCS09F921DD1A","OF37045","Smarthandle"]
["SI.SHCSF8F921DD1A","OF37046","Smarthandle"]
["SI.SHCS08G721CC1AWP","OF37047","Smarthandle"]
["SI.Z4.SR.30-35.MI.CO","OF37061",{"$f":"$I$2","v":"noch zu übersetzen"}]
["SI.Z4.SR.30-40.MI.CO","OF37062","noch zu übersetzen"]
["SI.Z4.SR.35-30.MI.CO","OF37063","noch zu übersetzen"]
["SI.Z4.35-60.MI.CO","OF37091","noch zu übersetzen"]
["SI.Z4.35-50.M.AP2.FD.WP","OF37102","noch zu übersetzen"]
["SI.Z4.40-50.M.AP2.FD.WP","OF37103","noch zu übersetzen"]
["SI.Z4.50-40.M.AP2.FD.WP","OF37104","noch zu übersetzen"]
["SI.Z4.35-60.M.CO","OF37105","noch zu übersetzen"]
["SI.SHCM09E721CC1AWP","OF37140",{"$f":"$I$1","v":"Smarthandle"}]
["SI.SHAM09B721BB1AWP","OF37141","Smarthandle"]
["SI.Z4.55-55.M.CO","OF37146",{"$f":"$I$2","v":"noch zu übersetzen"}]
["SI.SHAM09B721CC13WP","OF37195",{"$f":"$I$1","v":"Smarthandle"}]
["SI.SHAS08B901CC13","OF37196","Smarthandle"]
["SI.SHAS08B721CC13WP","OF37197","Smarthandle"]
["SI.Z4.30-40.MI.AP2.BL","OF37236",{"$f":"$I$2","v":"noch zu übersetzen"}]
["SI.SHCS08E921BB1AWP","OF37246",{"$f":"$I$1","v":"Smarthandle"}]
["SI.SHCL09F721BB1A","OF37248","Smarthandle"]
["SI.Z4.50-10.M.HZ.WP","OF37372",{"$f":"$I$2","v":"noch zu übersetzen"}]
["SI.SHAS08B722CC1A","OF37407",{"$f":"$I$1","v":"Smarthandle"}]
["SI.SHAS08B882CC1A","OF37408","Smarthandle"]
["SI.SHAM08B722CC1A","OF37409","Smarthandle"]
["SI.SHAM08A921AA1A","OF37419","Smarthandle"]
["SI.Z4.60-30.M.AP2.FD","OF37420",{"$f":"$I$2","v":"noch zu übersetzen"}]
["SI.SHCS08L001BB1A","OF37423",{"$f":"$I$1","v":"Smarthandle"}]
["SI.SHAS08A921DD1AWP","OF37424","Smarthandle"]
["SI.SHCS09E721CC1AWP","OF37425","Smarthandle"]
["SI.SHAM08B721CC1A","OF37435","Smarthandle"]
["SI.SHAM08D001CC1A","OF37436","Smarthandle"]
["SI.Z4.40-30.MI.AP2.BL","OF37446",{"$f":"$I$2","v":"noch zu übersetzen"}]
["SI.Z4.35-10.M.HZ.DK.WP","OF37447","noch zu übersetzen"]
["SI.Z4.30-30.M.AP2.FD.WP","OF37448","noch zu übersetzen"]
["SI.SHEM08E051AA1AWP","OF37451",{"$f":"$I$1","v":"Smarthandle"}]
["SI.Z4.35-30.MI.AP2.BL","OF37457",{"$f":"$I$2","v":"noch zu übersetzen"}]
["SI.SHAS09B701CC1A","OF37458",{"$f":"$I$1","v":"Smarthandle"}]
["SI.SHAM08A781FF1AWP","OF37476","Smarthandle"]
["SI.Z4.40-65.MI.CO","OF37493",{"$f":"$I$2","v":"noch zu übersetzen"}]
["SI.SHEM08H051CC1A","OF37510",{"$f":"$I$1","v":"Smarthandle"}]
["SI.SHCS08E721CC3A","OF37541","Smarthandle"]
["SI.SHCM08E721CC3A","OF37542","Smarthandle"]
["SI.SHCS08E721AA13","OF37543","Smarthandle"]
["SI.Z4.50-40.M.CO","OF37567",{"$f":"$I$2","v":"noch zu übersetzen"}]
["SI.SHAM08C001AA13","OF37588",{"$f":"$I$1","v":"Smarthandle"}]
["SI.SHAS09A724AA13","OF37622","Smarthandle"]
["SI.Z4.45-45.MI.FD.WP","OF37643",{"$f":"$I$2","v":"noch zu übersetzen"}]
["SI.Z4.60-60.MI.FD.WP","OF37644","noch zu übersetzen"]
["SI.SHAS07D001CC1A","OF37648",{"$f":"$I$1","v":"Smarthandle"}]
["SI.SHAM07D001CC1A","OF37649","Smarthandle"]
["SI.Z4.SO.A40.MI.MS","OF37660",{"$f":"$I$2","v":"noch zu übersetzen"}]
["SI.SHEL08I051AA3A","OF37661",{"$f":"$I$1","v":"Smarthandle"}]
["SI.Z4.45-30.MI.AP2.BL.WP","OF37662",{"$f":"$I$2","v":"noch zu übersetzen"}]
["SI.SHASF8A722BB1A","OF37676",{"$f":"$I$1","v":"Smarthandle"}]
["SI.SHES08H053CC1AWP","OF37716","Smarthandle"]
["SI.SHEM08H053CC1AWP","OF37717","Smarthandle"]
["SI.SHAM08B701CC13","OF37718","Smarthandle"]
["SI.SHAM08B721CC13","OF37719","Smarthandle"]
["SI.Z4.65-45.M.CO.WP","OF37720",{"$f":"$I$2","v":"noch zu übersetzen"}]
["SI.SHAM09B921CC1AWP","OF37723",{"$f":"$I$1","v":"Smarthandle"}]
["SI.Z4.70-40.MI.CO.WP","OF37726",{"$f":"$I$2","v":"noch zu übersetzen"}]
["SI.SHAS08A721DD1A","OF37727",{"$f":"$I$1","v":"Smarthandle"}]
["SI.SHASF8A921CC1A","OF37742","Smarthandle"]
["SI.TRAINING.WO.STARTER","OF37747",{"$f":"$I$3","v":"noch zu übersetzen"}]
["SI.Z4.40-45.MI.AP2.BL.WP","OF37752",{"$f":"$I$2","v":"noch zu übersetzen"}]
["SI.Z4.45-40.MI.AP2.BL.WP","OF37765","noch zu übersetzen"]
["SI.SHAS10A921CC1A","OF37780",{"$f":"$I$1","v":"Smarthandle"}]
["SI.SHCS08F851CC1A","OF37809","Smarthandle"]
["SI.SH.2.CSP.85","OF37841","Smarthandle"]
["SI.SHAS09D002BB1A","OF37844","Smarthandle"]
["SI.SHAL08A921FF1A","OF37861","Smarthandle"]
["SI-S2.E1.02.AA.1.S08.M.ER.WO","OF37881",{"$f":"$I$1","v":"Smarthandle"}]
["SI-S2.E1.02.AA.2.S08.M.ER.WO","OF37882",{"$f":"$I$1","v":"Smarthandle"}]
["SI-S2.E1.02.AA.7.S08.M.ER.WO","OF37883","Smarthandle"]
["SI-S2.E1.01.BB.1.S08.M.ER.VCN","OF37888","Smarthandle"]
["SI.Z4.35-10.M.HZ.SL","OF37889",{"$f":"$I$2","v":"noch zu übersetzen"}]
["SI.SHCS08K001CC13","OF37904",{"$f":"$I$1","v":"Smarthandle"}]
["SI.SHCS08K001CC13WP","OF37905","Smarthandle"]
["SI.SHCM09E721BB1A","OF37943","Smarthandle"]
["SI.SHCSF8K001CC1A","OF37949","Smarthandle"]
["SI.Z4.30-60.MI.AP2.BL","OF37962",{"$f":"$I$2","v":"noch zu übersetzen"}]
["SI.SHAM08A781FE1AWP","OF37963",{"$f":"$I$1","v":"Smarthandle"}]
["SI.SHAM09A921FE1AWP","OF37964","Smarthandle"]
["SI.Z4.60-30.MI.AP2.BL","OF37986",{"$f":"$I$2","v":"noch zu übersetzen"}]
["SI-S2.COVER.0.SG","OF37987",{"$f":"$I$1","v":"Smarthandle"}]
["SI-S2.COVER.0.W","OF37988","Smarthandle"]
["SI-S2.COVER.1.SG","OF37989","Smarthandle"]
["SI-S2.COVER.1.W","OF37990","Smarthandle"]
["SI-S2.COVER.2.SG","OF37991","Smarthandle"]
["SI-S2.COVER.2.W","OF37992","Smarthandle"]
["SI-S2.COVER.E0.SG","OF37993","Smarthandle"]
["SI-S2.COVER.E0.W","OF37994","Smarthandle"]
["SI-S2.COVER.E1.SG","OF37995","Smarthandle"]
["SI-S2.COVER.E1.W","OF37996","Smarthandle"]
["SI.SHAM09A721BB13","OF37998",{"$f":"$I$1","v":"Smarthandle"}]
["SI.Z4.30-60.M.CO.WP","OF38019",{"$f":"$I$2","v":"noch zu übersetzen"}]
["SI.Z4.50-45.M.CO","OF38020","noch zu übersetzen"]
["SI.Z4.35-65.MI.CO","OF38041","noch zu übersetzen"]
["SI.Z4.140-30.M.CO","OF38043","noch zu übersetzen"]
["SI.Z4.140-30.M.CO.WP","OF38044","noch zu übersetzen"]
["SI.SHAS08C001CC1AWP","OF38048",{"$f":"$I$1","v":"Smarthandle"}]
["SI.SHAL10A921AA1AWP","OF38058","Smarthandle"]
["SI.SHCL10G921AA1AWP","OF38059","Smarthandle"]
["SI.SHAS08A721BB1AWP","OF38061","Smarthandle"]
["SI.SHDM09E781DD1A","OF38063","Smarthandle"]
["SI.SHDS09E781DD1A","OF38064","Smarthandle"]
["SI.SHAS09A722BB1A","OF38067","Smarthandle"]
["SI.Z4.30-30.MI.CO.BK","OF38071",{"$f":"$I$2","v":"noch zu übersetzen"}]
["SI.Z4.30-10.MI.HZ.BK","OF38072","noch zu übersetzen"]
["SI.Z4.SO.A40.MI.BK","OF38073","noch zu übersetzen"]
["SI.SHCS09E723AA1A","OF38083",{"$f":"$I$1","v":"Smarthandle"}]
["SI.Z4.30-35.MI.AP2.BL.WP","OF38084",{"$f":"$I$2","v":"noch zu übersetzen"}]
["SI.Z4.30-50.MI.AP2.BL","OF38085","noch zu übersetzen"]
["SI.Z4.35-30.MI.AP2.BL.WP","OF38086","noch zu übersetzen"]
["SI.Z4.50-40.MI.AP2.BL.WP","OF38087","noch zu übersetzen"]
["SI.Z4.35-40.MI.AP2.BL","OF38088","noch zu übersetzen"]
["SI.Z4.35-50.MI.AP2.BL","OF38089","noch zu übersetzen"]
["SI.Z4.40-35.MI.AP2.BL","OF38090","noch zu übersetzen"]
["SI.Z4.50-35.MI.AP2.BL","OF38091","noch zu übersetzen"]
["SI.Z4.50-40.MI.AP2.BL","OF38092","noch zu übersetzen"]
["SI.Z4.50-45.MI.AP2.BL","OF38093","noch zu übersetzen"]
["SI.Z4.45-50.MI.FD","OF38094","noch zu übersetzen"]
["SI.Z4.50-35.MI.FD","OF38095","noch zu übersetzen"]
["SI.Z4.50-35.MI.FD.WP","OF38096","noch zu übersetzen"]
["SI.SHCM10G921AA1AWP","OF38097",{"$f":"$I$1","v":"Smarthandle"}]
["SI.SHAM10A921AA1AWP","OF38098","Smarthandle"]
["SI.SHAL09A921DE1AWP","OF38111","Smarthandle"]
["SI.SHAM09A921DE1AWP","OF38112","Smarthandle"]
["SI.SHAM09A721BE1A","OF38113","Smarthandle"]
["SI.Z4.45-40.MI.AP2.BL","OF38117",{"$f":"$I$2","v":"noch zu übersetzen"}]
["SI.Z4.45-30.MI.AP2.BL","OF38118","noch zu übersetzen"]
["SI-S2.E1.01.BB.1.S08.M.VCN","OF38124",{"$f":"$I$1","v":"Smarthandle"}]
["SI.SHES08F053AA1A","OF38128",{"$f":"$I$1","v":"Smarthandle"}]
["SI.Z4.35-65.M.CO.WP","OF38222",{"$f":"$I$2","v":"noch zu übersetzen"}]
["SI.Z4.65-30.M.CO.WP","OF38223","noch zu übersetzen"]
["SI.SHCSF8K001BB1A","OF38225",{"$f":"$I$1","v":"Smarthandle"}]
["SI.SHCM08E921DD1A","OF38235","Smarthandle"]
["SI.SHAL09B721AA1AWP","OF38236","Smarthandle"]
["SI.SHCM09E921CC3A","OF38253","Smarthandle"]
["SI.SHAS08A921CC1A","OF38259","Smarthandle"]
["SI-S2.E1.01.BB.1.S08.0","OF38276",{"$f":"$I$1","v":"Smarthandle"}]
["SI.SHAM09B921BB1AWP","OF38279",{"$f":"$I$1","v":"Smarthandle"}]
["SI.SHCS07F721AA1A","OF38282","Smarthandle"]
["SI.SHCL08F721DD1AWP","OF38295","Smarthandle"]
["SI.SHAS08C001BB13","OF38315","Smarthandle"]
["SI.SHCSF8E721AA1A","OF38328","Smarthandle"]
["SI.SHCM09E721AA1A","OF38329","Smarthandle"]
["SI.SHEM08H054CC1A","OF38331","Smarthandle"]
["SI.Z4.30-40.MI.FD.WP","OF38336",{"$f":"$I$2","v":"noch zu übersetzen"}]
["SI.SHDL09E941EE1A","OF38342",{"$f":"$I$1","v":"Smarthandle"}]
["SI.SHEM08K054CC1A","OF38350","Smarthandle"]
["SI.Z4.35-10.MI.HZ.SL","OF38352",{"$f":"$I$2","v":"noch zu übersetzen"}]
["SI-S2.A1.01.AA.1.S08.M.WO","OF38355",{"$f":"$I$1","v":"Smarthandle"}]
["SI-S2.A1.01.CC.2.S08.M.WO","OF38356","Smarthandle"]
["SI-S2.E0.01.AA.1.S08.M.ER.WO","OF38357","Smarthandle"]
["SI-S2.E0.01.CC.2.S08.M.ER.WO","OF38358","Smarthandle"]
["SI-S2.E1.01.AA.1.S08.M.ER.WO","OF38359","Smarthandle"]
["SI-S2.E1.01.CC.2.S08.M.ER.WO","OF38360","Smarthandle"]
["SI-S2.E1.02.CC.1.S08.M.ER.WO","OF38361","Smarthandle"]
["SI-S2.A1.01.BB.1.S08.M.WO","OF38369","Smarthandle"]
["SI-S2.A1.01.BB.1.S08.M.ER.WO","OF38370","Smarthandle"]
["SI-S2.A1.01.AA.1.S08.M.ER.WO","OF38371","Smarthandle"]
["SI-S2.A1.01.CC.1.S08.M.WO","OF38372","Smarthandle"]
["SI-S2.A1.01.CC.1.S08.M.ER.WO","OF38373","Smarthandle"]
["SI-S2.A1.01.DD.1.S08.M.WO","OF38374","Smarthandle"]
["SI-S2.A1.01.DD.1.S08.M.ER.WO","OF38375","Smarthandle"]
["SI-S2.A1.01.AA.2.S08.M.WO","OF38376","Smarthandle"]
["SI-S2.A1.01.AA.2.S08.M.ER.WO","OF38377","Smarthandle"]
["SI-S2.A1.01.BB.2.S08.M.WO","OF38378","Smarthandle"]
["SI-S2.A1.01.BB.2.S08.M.ER.WO","OF38379","Smarthandle"]
["SI-S2.A1.01.CC.2.S08.M.ER.WO","OF38380","Smarthandle"]
["SI-S2.A1.01.DD.2.S08.M.WO","OF38381","Smarthandle"]
["SI-S2.A1.01.DD.2.S08.M.ER.WO","OF38382","Smarthandle"]
["SI-S2.E0.01.BB.1.S08.M.ER.WO","OF38385","Smarthandle"]
["SI.SHAS08A721AA3AWP","OF38411",{"$f":"$I$1","v":"Smarthandle"}]
["SI.SHCS08E901EE1A","OF38412","Smarthandle"]
["SI.SHAM08A921EE1AWP","OF38419","Smarthandle"]
["SI.GN.CONFIG.EC","OF9928",{"$f":"$I$5","v":"noch zu übersetzen"}]
["SI.GN.CONFIG.UC","OF9929",{"$f":"$I$5","v":"noch zu übersetzen"}]
["SI.GN.CR","OF9930","noch zu übersetzen"]
["SI.GN.DEMO.UR","OF9931","noch zu übersetzen"]
["SI.GN.ER","OF9932","noch zu übersetzen"]
["SI.GN.ER.M","OF9933","noch zu übersetzen"]
["SI.GN.R","OF9934","noch zu übersetzen"]
["SI.GN2.ER","OF9935","noch zu übersetzen"]
["SI.GN2.ER.M","OF9936","noch zu übersetzen"]
["SI.MOCKUP.SH.A","OF9942",{"$f":"$I$1","v":"Smarthandle"}]
["SI.MOCKUP.Z4.MI","OF9943",{"$f":"$I$2","v":"noch zu übersetzen"}]
["SI.MOCKUP.Z4.MI.CO","OF9944",{"$f":"$I$2","v":"noch zu übersetzen"}]
["SI.N.IO","OF9945",{"$f":"$I$5","v":"noch zu übersetzen"}]
["SI.PINCODE","OF9946",{"$f":"$I$4","v":"noch zu übersetzen"}]
["SI.SH.2.CBP","OF9948",{"$f":"$I$1","v":"Smarthandle"}]
["SI.SH.2.CBP.SO.105","OF9949","Smarthandle"]
["SI.SH.2.CSP","OF9950","Smarthandle"]
["SI.SH.2.CSP.SO","OF9951","Smarthandle"]
["SI.SH.2.CSP.SO.105","OF9952","Smarthandle"]
["SI.SH.CB","OF9953","Smarthandle"]
["SI.SH.CB.72","OF9954","Smarthandle"]
["SI.SH.CB.75","OF9955","Smarthandle"]
["SI.SH.CB.78","OF9956","Smarthandle"]
["SI.SH.CB.85","OF9957","Smarthandle"]
["SI.SH.CB.88","OF9958","Smarthandle"]
["SI.SH.CB.90","OF9959","Smarthandle"]
["SI.SH.CB.92","OF9960","Smarthandle"]
["SI.SH.CB.SO","OF9961","Smarthandle"]
["SI.SH.CB.SO.105","OF9962","Smarthandle"]
["SI.SH.CB.SO.MS","OF9963","Smarthandle"]
["SI.SH.CBP","OF9964","Smarthandle"]
["SI.SH.CBP.72","OF9965","Smarthandle"]
["SI.SH.CBP.75","OF9966","Smarthandle"]
["SI.SH.CBP.78","OF9967","Smarthandle"]
["SI.SH.CBP.85","OF9968","Smarthandle"]
["SI.SH.CBP.88","OF9969","Smarthandle"]
["SI.SH.CBP.90","OF9970","Smarthandle"]
["SI.SH.CBP.92","OF9971","Smarthandle"]
["SI.SH.CBP.SO","OF9972","Smarthandle"]
["SI.SH.CBP.SO.105","OF9973","Smarthandle"]
["SI.SH.CBP.SO.105.MS","OF9974","Smarthandle"]
["SI.SH.CS","OF9975","Smarthandle"]
["SI.SH.CS.72","OF9976","Smarthandle"]
["SI.SH.CS.75","OF9977","Smarthandle"]
["SI.SH.CS.78","OF9978","Smarthandle"]
["SI.SH.CS.85","OF9979","Smarthandle"]
["SI.SH.CS.88","OF9980","Smarthandle"]
["SI.SH.CS.90","OF9981","Smarthandle"]
["SI.SH.CS.92","OF9982","Smarthandle"]
["SI.SH.CS.SO","OF9983","Smarthandle"]
["SI.SH.CS.SO.105","OF9984","Smarthandle"]
["SI.SH.CSP","OF9985","Smarthandle"]
["SI.SH.CSP.72","OF9986","Smarthandle"]
["SI.SH.CSP.75","OF9987","Smarthandle"]
["SI.SH.CSP.78","OF9988","Smarthandle"]
["SI.SH.CSP.85","OF9989","Smarthandle"]
["SI.SH.CSP.88","OF9990","Smarthandle"]
["SI.SH.CSP.90","OF9991","Smarthandle"]
["SI.SH.CSP.92","OF9992","Smarthandle"]
["SI.SH.CSP.SO","OF9993","Smarthandle"]
["SI.SH.CSP.SO.105","OF9994",{"$f":"$I$1","v":"Smarthandle"}]
["SI.SHAL08A721BB13","OF9995","Smarthandle"]
["SI.SHAL08A851AA1AWP","OF9996","Smarthandle"]
["SI.SHAL08A901AA1A","OF9997","Smarthandle"]
["SI.SHAL08A901CC1AWP","OF9998","Smarthandle"]
["SI.SHAL08A921AA1A","OF9999","Smarthandle"]
["TRA.DESFIRE2K.100","OF11326",{"$f":"$I$4","v":"noch zu übersetzen"}]
["TRA.DESFIRE2K.5","OF11327",{"$f":"$I$4","v":"noch zu übersetzen"}]
["TRA.DESFIRE4K.100","OF11328","noch zu übersetzen"]
["TRA.DESFIRE4K.5","OF11329","noch zu übersetzen"]
["TRA.DESFIRE8K.100","OF11330","noch zu übersetzen"]
["TRA.DESFIRE8K.5","OF11331","noch zu übersetzen"]
["TRA.MIFARE1K.100","OF11434","noch zu übersetzen"]
["TRA.MIFARE1K.5","OF11435","noch zu übersetzen"]
["TRA.MIFARE4K.100","OF11436","noch zu übersetzen"]
["TRA.MIFARE4K.5","OF11437","noch zu übersetzen"]
["TRA.TAG.DESFIRE2K.100","OF11524","noch zu übersetzen"]
["TRA.TAG.DESFIRE2K.5","OF11525","noch zu übersetzen"]
["TRA.TAG.DESFIRE4K.100","OF11526",{"$f":"$I$4","v":"noch zu übersetzen"}]
["TRA.TAG.DESFIRE4K.5","OF11527","noch zu übersetzen"]
["TRA.TAG.DESFIRE8K.100","OF11528","noch zu übersetzen"]
["TRA.TAG.DESFIRE8K.5","OF11529","noch zu übersetzen"]
["TRA.TAG.MIFARE1K.100","OF11530","noch zu übersetzen"]
["TRA.TAG.MIFARE1K.5","OF11534","noch zu übersetzen"]
["TRA.TAG.MIFARE4K.100","OF11538","noch zu übersetzen"]
["TRA.TAG.MIFARE4K.5","OF11539","noch zu übersetzen"]
["SI.SHAL09B921CC1AWP","OF38600",{"$f":"$I$1","v":"Smarthandle"}]
["SI.SHAL09B921DE13WP","OF38609",{"$f":"$I$1","v":"Smarthandle"}]
["SI.SHAM07A701CC1A","OF38526",{"$f":"$I$1","v":"Smarthandle"}]
["SI.SHAM07A851CC1AWP","OF38525","Smarthandle"]
["SI.SHAM08B901CC1AWP","OF38659","Smarthandle"]
["SI.SHAM08C001CK1ADP","OF38607","Smarthandle"]
["SI.SHAM09A921AA1AWP","OF38439","Smarthandle"]
["SI.SHAM09A921BE1A","OF38700","Smarthandle"]
["SI.SHAM09A921EE13","OF38480","Smarthandle"]
["SI.SHAM09B921DE13WP","OF38610","Smarthandle"]
["SI.SHAS08A882CC1A","OF38681","Smarthandle"]
["SI.SHAS08A921EE13","OF38482","Smarthandle"]
["SI.SHAS08C001AK1ADP","OF38533","Smarthandle"]
["SI.SHAS09A921CC1A","OF38938","Smarthandle"]
["SI.SHAS09A921EE13","OF38481","Smarthandle"]
["SI.SHASF8C002CC1A","OF38561","Smarthandle"]
["SI.SHBS08C054CC13","OF38843","Smarthandle"]
["SI.SHBS08D054CC1A","OF38455","Smarthandle"]
["SI.SHCL08E721CC1A","OF38916","Smarthandle"]
["SI.SHCL08E721CC1AWP","OF38917","Smarthandle"]
["SI.SHCL08F881DD1A","OF38650","Smarthandle"]
["SI.SHCM08E921CC1A","OF38918","Smarthandle"]
["SI.SHCM08I881BB1A","OF38783","Smarthandle"]
["SI.SHCM09E721AA1AWP","OF38430","Smarthandle"]
["SI.SHCS08E881AA1A","OF38431","Smarthandle"]
["SI.SHCS08E921CC13WP","OF38838","Smarthandle"]
["SI.SHCS08E921CC1AWP","OF38915","Smarthandle"]
["SI.SHCS09E901AA1A","OF38743",{"$f":"$I$1","v":"Smarthandle"}]
["SI.SHCS09F721CC13","OF38433","Smarthandle"]
["SI.SHCSF8G851CC1A","OF38490","Smarthandle"]
["SI.SHDM09F741BB1A","OF38463","Smarthandle"]
["SI.SHES08G051AA1AWP","OF38598","Smarthandle"]
["SI.SHFS08F721EE1A","OF38548","Smarthandle"]
["SI.SHIL09E941EE1A","OF38612","Smarthandle"]
["SI.SHIM09E941EE1AWP","OF38608","Smarthandle"]
["SI.Z4.30-70.M.AP2.FD","OF38519",{"$f":"$I$2","v":"noch zu übersetzen"}]
["SI.Z4.35-30.M.AP2.FD.WP","OF38516",{"$f":"$I$2","v":"noch zu übersetzen"}]
["SI.Z4.35-35.MI.CO.WP.MS","OF38496",{"$f":"$I$2","v":"noch zu übersetzen"}]
["SI.Z4.35-45.MI.FD","OF38683","noch zu übersetzen"]
["SI.Z4.40-30.M.AP2.FD.WP","OF38515","noch zu übersetzen"]
["SI.Z4.40-35.M.AP2.FD.WP","OF38514","noch zu übersetzen"]
["SI.Z4.40-35.MI.AP2.BL.SKG.WP","OF38527","noch zu übersetzen"]
["SI.Z4.45-30.MI.AP2.FD.OK.WP","OF38605","noch zu übersetzen"]
["SI.Z4.45-30.MI.AP2.FD.WP","OF38680","noch zu übersetzen"]
["SI.Z4.45-40.M.AP2.FD.WP","OF38520","noch zu übersetzen"]
["SI.Z4.50-45.M.AP2.FD","OF38517","noch zu übersetzen"]
["SI.Z4.60-30.MI.AP2.BL.WP","OF38762","noch zu übersetzen"]
["SI.Z4.60-30.MI.CO.MS","OF38493","noch zu übersetzen"]
["SI.Z4.60-30.MI.CO.WP.MS","OF38491","noch zu übersetzen"]
["SI.Z4.60-30.MI.CO.WP.MS.ZK","OF38492","noch zu übersetzen"]
["SI.Z4.60-50.MI.CO","OF38799","noch zu übersetzen"]
["SI.Z4.60-60.M.CO","OF38723","noch zu übersetzen"]
["SI.Z4.65-10.MI.HZ","OF38460","noch zu übersetzen"]
["SI.Z4.65-30.M.AP2.FD","OF38746","noch zu übersetzen"]
["SI.Z4.65-40.M.CO.WP","OF38720","noch zu übersetzen"]
["SI.Z4.80-30.MI.CO.WP","OF38461","noch zu übersetzen"]
["SI.Z4.85-100.MI.CO.WP","OF38580","noch zu übersetzen"]
["SI.Z4.RS.A40.M","OF38832","noch zu übersetzen"]
["SI.Z4.SO.A40.M","OF38831","noch zu übersetzen"]
["SI.Z4.SR.50-30.MI.CO.WP","OF38856","noch zu übersetzen"]
["SI-S2.A0.01.CC.1.S08.M.WO","OF38859",{"$f":"$I$1","v":"Smarthandle"}]
["SI-S2.A0.11.CC.1.S08.M.WO","OF38541","Smarthandle"]
["SI-S2.A0.11.CC.2.S08.M.WO","OF38542","Smarthandle"]

{"sheet":"Tabelle3","index":20,"n_rows":0,"n_cols":0,"rows_kept":0,"cut":false,"hidden":true,"merged":[]}