{"text_format":"1","workbook":"xlsx","n_sheets":21,"sheets":["Hauptseite - main page","Bestellhilfe - ordering guide","Bilder","SI_Programming_Gateways","SI_Zylinder","SmartHandle Cover - order tool","SmartHandle Cover - overview","Zusammenfassung - summary","Comments","CommentsZyl","Bilder_SI_Zylinder","Bilder SH-Cover für Anzeige","Bilder SH-Cover sortiert","Langtext_Cover_Übers.","Bilder für Rückwärtssuche","Tabelle1","Hilfstabelle für Zus.fass.","ID medium","Tabelle2","OF-No.","Tabelle3"],"not_rendered":{"charts":0,"images":117,"macros":1,"external_links":3,"defined_names":176,"comments":5,"pivot_tables":0},"unopened":[],"bounds":{"document_bytes":16777216,"sheet_cells":100000,"rows_first":2000,"rows_last":500,"rows_between":2000,"halvings":0,"cell_chars":16384,"cell_head_chars":4096},"cells_cut":0,"cells_raw":0,"read":"whole","date_system":"1900"}

{"sheet":"Hauptseite - main page","index":0,"n_rows":236,"n_cols":11,"rows_kept":236,"cut":false,"hidden":true,"merged":[[23,4,23,5],[23,6,23,8],[23,9,23,11],[35,8,38,10],[1,5,1,8],[2,6,2,7],[3,5,3,8],[8,8,13,13],[7,2,7,6],[8,2,8,6],[10,2,10,6],[11,2,11,6],[13,2,13,6],[44,1,44,13],[181,0,181,1],[181,4,181,5],[181,7,181,8],[182,4,182,5],[182,7,182,8],[177,0,177,1],[176,0,176,1],[177,4,177,5],[176,4,176,5],[176,7,176,8],[177,7,177,8],[55,0,55,13],[59,0,59,13]]}
[]
["SmartIntego -",null,null,null,null,"Sprache / language / langue / lingua / taal / sprog"]
[{"$f":"HLOOKUP(G3,A207:F227,13,0)","v":"noch zu übersetzen"},null,null,null,null,null,"Dansk"]
[null,null,null,null,null,{"$f":"SI_Programming_Gateways!J190","v":"*** Aktiver venligst makroer ***"}]
[]
[]
{"$rows_left_out":231}
{"sheet":"Bestellhilfe - ordering guide","index":1,"n_rows":733,"n_cols":143,"rows_kept":733,"cut":false,"hidden":false,"merged":[[110,7,110,8],[132,7,132,8],[13,1,13,2],[13,4,13,5],[13,6,13,9],[26,0,26,10],[27,0,27,10],[28,0,28,10],[7,13,7,14],[8,3,8,5],[8,13,8,14],[11,4,11,5],[11,6,11,7],[11,11,11,13],[6,13,6,14],[1,7,1,10],[2,0,2,6],[3,7,3,10],[5,5,5,6],[5,7,5,10]]}
[" "]
[]
[{"$f":"HLOOKUP($I$3,A234:G302,2,0)","v":"Hjælp til bestilling af Digitalt SmartHandle - AX"},null,null,null,null,null,null,null,{"$f":"'Hauptseite - main page'!G3","v":"Dansk"}]
[]
[null,null,null,null,null,null,null,null,null,null,null,null,null,null,null,null,"Stand: 10 / 2019"]
[null,null,{"$f":"HLOOKUP($I$3,A234:G302,47,0)","v":"for at se SmartHandle vælges de med gult markerede felter i drop-down menuen"},null,{"$f":"J351","v":"Yderside"},{"$f":"J352","v":"Inderside"},null,{"$f":"HLOOKUP($I$3,$A$234:$G$310,4,0)","v":"Vælg håndtagsvarianter"},null,null,null,null,null,null,{"$f":"I360","v":"Dimensioneringer"},"Cover"]
{"$rows_left_out":728}
{"sheet":"Bilder","index":2,"n_rows":36,"n_cols":26,"rows_kept":36,"cut":false,"hidden":true,"merged":[]}
["Bemaßung","Deutsch","English","Français","Italiano","Nederlands"]
[]
[]
[]
[]
["Drücker","A.","B.","C.","D.","E.","F."]
{"$rows_left_out":31}
{"sheet":"SI_Programming_Gateways","index":3,"n_rows":656,"n_cols":31,"rows_kept":656,"cut":false,"hidden":true,"merged":[[43,14,43,15],[40,8,40,13],[39,8,39,13],[41,8,41,13],[14,1,14,2],[14,4,14,5],[14,12,14,14],[14,6,14,9],[36,3,36,4],[37,3,37,4],[38,3,38,4],[36,1,36,2],[37,1,37,2],[38,1,38,2],[5,13,5,14],[12,11,12,13],[36,8,36,13],[37,8,37,13],[38,8,38,13],[11,14,11,15],[12,14,12,15],[1,7,1,10],[7,3,7,4],[12,6,12,7],[3,7,3,10],[5,2,5,4],[6,1,6,2],[12,4,12,5],[5,0,5,1]]}
[]
["SmartIntego -"]
[{"$f":"HLOOKUP($W$16,A158:F179,22,0)","v":"Ordering Guide programming & Gateways"},null,null,null,null,null,null,null,{"$f":"'Hauptseite - main page'!G3","v":"Dansk"}]
[null,null,null,null,null,null,null,{"$f":"HLOOKUP($W$16,A158:F190,33,0)","v":"*** Aktiver venligst makroer ***"}]
[]
[{"$f":"HLOOKUP($W$16,A158:F180,23,0)","v":"Europrofil / Schweizisk Rund"},null,{"$f":"HLOOKUP($W$16,A158:F207,50,0)","v":"Skandinavisk Oval"},null,null,null,null,{"$f":"HLOOKUP($W$16,A158:F181,24,0)","v":"Vælg håndtagsvariant"},null,null,null,null,null,{"$f":"HYPERLINK(HLOOKUP($W$16,A158:F208,51,0),HLOOKUP($W$16,A158:F189,32,0))","v":"Download bestillingsvejledning"}]
{"$rows_left_out":651}
{"sheet":"SI_Zylinder","index":4,"n_rows":733,"n_cols":24,"rows_kept":733,"cut":false,"hidden":true,"merged":[[1,5,1,6],[3,5,3,6],[29,0,36,8],[4,7,4,8],[5,7,5,8],[13,3,13,4],[15,1,15,2],[18,1,18,2],[27,8,27,9]]}
[]
["SmartIntego"]
[{"$f":"HLOOKUP($O$16,A234:F254,14,0)","v":"Bestillingsvejledning til digitale låsecylindre"},null,null,null,null,{"$f":"'Hauptseite - main page'!G3","v":"Dansk"}]
[]
[]
[{"$f":"HLOOKUP($O$16,A234:F254,3,0)","v":"Låsecylinder type / varenummer"},{"$f":"IF(OR(A7=\"Scandinavian_Oval\",A7=\"Scandinavian_Round\"),\"\",HLOOKUP($O$16,A234:F257,23,0))","v":"Udvendig længde"},null,{"$f":"IF(OR(A7=\"Scandinavian_Oval\",A7=\"Scandinavian_Round\"),\"\",HLOOKUP($O$16,A234:F257,24,0))","v":"Indvendig længde"}]
{"$rows_left_out":728}
{"sheet":"SmartHandle Cover - order tool","index":5,"n_rows":325,"n_cols":50,"rows_kept":325,"cut":false,"hidden":true,"merged":[[19,3,19,7],[20,3,20,7],[21,3,21,7],[22,3,22,7],[1,3,1,6],[3,3,3,6],[6,7,7,7],[6,0,7,0],[6,5,7,5],[16,0,16,6],[18,3,18,7],[17,3,17,7],[6,1,7,1],[6,2,7,2],[6,3,7,3],[6,6,7,6],[6,4,7,4]]}
[]
[]
[{"$f":"HLOOKUP($J$3,$A$62:$F$114,2,0)","v":{"$error":"#N/A"}},null,null,null,null,{"$f":"'Hauptseite - main page'!G3","v":"Dansk"},null,null,null,{"$f":"'Hauptseite - main page'!G3","v":"Dansk"}]
[]
[]
[]
{"$rows_left_out":320}
{"sheet":"SmartHandle Cover - overview","index":6,"n_rows":111,"n_cols":48,"rows_kept":111,"cut":false,"hidden":true,"merged":[[9,4,9,5],[12,0,12,5],[14,4,14,5],[15,3,15,4],[1,3,1,5],[3,3,3,5],[6,0,7,0],[6,1,7,1],[6,2,7,2],[6,3,7,3],[6,4,6,5]]}
[]
[]
[{"$f":"HLOOKUP($I$3,$A$58:$F$110,2,0)","v":{"$error":"#N/A"}},null,null,null,null,null,null,null,{"$f":"'Hauptseite - main page'!G3","v":"Dansk"}]
[]
[]
[]
{"$rows_left_out":106}
{"sheet":"Zusammenfassung - summary","index":7,"n_rows":68,"n_cols":29,"rows_kept":68,"cut":false,"hidden":true,"merged":[[17,1,17,3],[16,0,16,3],[1,0,1,3],[6,0,6,1],[7,0,7,1],[9,0,9,1],[10,0,10,1],[12,0,12,1],[14,2,14,3]]}
[]
[{"$f":"HLOOKUP(G2,SI_Programming_Gateways!A158:F236,79,0)","v":"noch zu übersetzen"},null,null,null,null,null,{"$f":"'Hauptseite - main page'!G3:G3","v":"Dansk"}]
[null,null,null,null,null,null,{"$f":"SI_Programming_Gateways!J235","v":"noch zu übersetzen"}]
[]
[]
[]
{"$rows_left_out":63}
{"sheet":"Comments","index":8,"n_rows":25,"n_cols":7,"rows_kept":25,"cut":false,"hidden":true,"merged":[]}
["Sprache","Deutsch","English","Francais","Italiano","Nederlands","Dansk"]
["Wireless online / Virtual CardNetwork","Wireless Online\nVirtual CardNetwork","Wireless Online\nVirtual CardNetwork","Wireless Online\nVirtual CardNetwork","Wireless Online\nVirtual CardNetwork","Wireless Online\nVirtual CardNetwork","Wireless Online\nVirtual CardNetwork"]
["SmartHandle Typ","Standard SmartHandle (ohne Door Monitoring)\nDoor Monitoring (SV Sensorik)\nDoor Monitoring  (Schlosssensorik)\nDoor Monitoring (Drückersensorik)","Standard SmartHandle (without Door Monitoring)\nDoor Monitoring (SV sensors)\nDoor Monitoring (sensor locks)\nDoor Monitoring (handle sensor)","SmartHandle standard (sans Door Monitoring)\nDoor Monitoring (capteurs SV)\nDoor Monitoring (capteurs externes)\nDoor monitoring (capteur poignée)","SmartHandle standard (Senza DoorMonitoring)\nDoor Monitoring (sensore SV)\nDoor Monitoring (sensore esterno)\nDoor Monitoring (sensore sulla leva)","Standaard SmartHandle (zonder deurstand signalering)\nDeurstand signalering (SV sensors)\nDeurstand signalering (externe sensors)\nDeurstand signalering (kruk sensor)","Standard SmartHandle (uden dør monitorering)\nDør monitorering (SV sensorer)\nDør monitorering  (eksterne sensorer)\nDør monitorering (dørgrebs sensor)"]
["Profilname","Europrofil ohne MO\nSwiss Round ohne MO\nScandinavian Oval ohne MO\nEuroprofil mit MO\nSwiss Round mit MO\nScandinavian Oval mit MO\nEuroprofil mit MO (Plattensystem)","Europrofile without Mechanical Override (MO)\nSwiss Round without Mechanical Override (MO)\nScandinavian Oval without Mechanical Override (MO)\nEuroprofil with Mechanical Override (MO)\nSwiss Round with Mechanical Override (MO)\nScandinavian Oval with Mechanical Override (MO)\nEuro profile with Mechanical Override (MO) - plate system","Profil européen sans verrouillage mécanique\nProfil suisse sans verrouillage mécanique\nOvale scandinave sans verrouillage mécanique\nprofil européen avec Verrouillage mécanique (VM),     \nprofil suisse avec Verrouillage mécanique (VM)\nOvale scandinave avec Verrouillage mécanique (VM)","profilo europeo senza Mechanical Override (MO)\ntondo svizzero senza Mechanical Override (MO)\nBritish Oval senza Mechanical Override (MO)\nScandinavian Oval senza Mechanical Override (MO)\nprofilo europeo con mechanical override (MO)\ntondo svizzero con mechanical override (MO)\nScandinavian Oval con Mechanical Override (MO)","Wireless online\n Virtual CardNetwork","Europrofil uden udstandsning til låsecylinder\nSchweizisk Rund uden udstandsning til låsecylinder\nSkandinavisk Oval uden udstandsning til låsecylinder\nSchweizisk Rund med udstandsning til låsecylinder\nEuroprofil med udstandsning til låsecylinder\nSkandinavisk Oval med udstandsning til låsecylinder"]
["Profil","A = \nEuroprofil, \nSwiss Round,\n\nB =\nScandinavian Oval\n\nC =\nEuroprofil mit Mechanical Override (MO)\n\nD =\nSwiss Round mit Mechanical Override (MO)\n\nE =\nScandinavian Oval mit Mechanical Override (MO)","A = \nEuroprofile, \nSwiss Round,\n\nB =\nScandinavian Oval\n\nC =\nEuroprofile with Mechanical Override (MO)\n\nD =\nSwiss Round with Mechanical Override (MO)\n\nE =\nScandinavian Oval with Mechanical Override (MO)","A = \nprofil européen, \nprofil suisse,\n\nB =\nOvale scandinave\n\nC =\nprofil européen avec Verrouillage mécanique (VM)\n\nD =\nprofil suisse avec Verrouillage mécanique (VM)\n\nE =\nOvale scandinave avec verrouillage mécanique (VM)","A = \nprofilo europeo, \ntondo svizzero,\n\nB =\nScandinavian Oval\n\nC =\nprofilo europeo con mechanical override (MO)\n\nD =\ntondo svizzero con mechanical override (MO)\n\nE =\nScandinavian Oval con Mechanical Override (MO)","A = \nEuro profiel, \nSwiss Round,\n\nB =\nScandinavian Oval\n\nC =\nEuro profiel met mechanical Override (MO)\n\nD =\nSwiss Round met mechanical Override (MO)\n\nE =\nScandinavian Oval met Mechanical Override (MO)","A = \nEuroprofil, \nSchweizisk Rund,\n\nB =\nSkandinavisk Oval\n\nC =\nEuroprofil med udstandsning til låsecylinder\n\nD =\nSchweizisk Rund med udstandsning til låsecylinder\n\nE =\nSkandinavisk Oval med udstandsning til låsecylinder"]
["Türdicke","Für PZ-Profil / Swiss Round:\nS = 39-60 mm\nM = 59-80 mm\nL = 79-100 mm\n\nfür Scandinavian Oval Profil:\nS = 33-50 mm\nM = 49-70 mm\nL = 69-94 mm","for Europrofile / Swiss Round:\nS = 39-60 mm\nM = 59-80 mm\nL = 79-100 mm\n\nfor SO lock type:\nS = 33-50 mm\nM = 49-70 mm\nL = 69-94 mm","pour type de profil européen / profil suisse:\nS = 39-60 mm\nM = 59-80 mm\nL = 79-100 mm\n\npour type de serrure SO (Ovale scandinave):\nS = 33-50 mm\nM = 49-70 mm\nL = 69-94 mm","for profilo europeo:\nS = 39-60 mm\nM = 59-80 mm\nL = 79-100 mm\n\nfor Scandinavian Oval profilo:\nS = 33-50 mm\nM = 49-70 mm\nL = 69-94 mm","voor Euro profiel / Swiss Round:\nS = 39-60 mm\nM = 59-80 mm\nL = 79-100 mm\n\nvoor Scandinavian Oval profiel:\nS = 33-50 mm\nM = 49-70 mm\nL = 69-94 mm","til Europrofil / Schweizisk Rund:\nS = 39-60 mm\nM = 59-80 mm\nL = 79-100 mm\n\ntil Skandinavisk Oval:\nS = 33-50 mm\nM = 49-70 mm\nL = 69-94 mm"]
{"$rows_left_out":20}
{"sheet":"CommentsZyl","index":9,"n_rows":13,"n_cols":7,"rows_kept":13,"cut":false,"hidden":true,"merged":[]}
["Sprache","Deutsch","English","Français","Italiano","Nederlands","Dansk"]
["Profil","Europrofil\nSwiss Round\nScandinavian Oval\nScandinavian Round","Europrofile\nSwiss Round\nScandinavian Oval\nScandinavian Round","Profil européen\nProfil suisse\nOvale scandinave\nRond scandinave","profilo europeo\ntondo svizzero\nScandinavian Oval\nScandinavian Round","Euro profiel\nSwiss Round\nScandinavian Oval\nScandinavian Round","Europrofil\nSchweizisk Rund\nSkandinavisk Oval\nSkandinavisk Rund"]
["Wireless online / Virtual CardNetwork","Wireless Online\nVirtual CardNetwork","Wireless Online\nVirtual CardNetwork","Wireless Online\nVirtual CardNetwork","Wireless Online\nVirtual CardNetwork","Wireless Online\nVirtual CardNetwork","Wireless Online\nVirtual CardNetwork"]
["Variante","M(I).CO - Comfort\nMI.FD - Freidrehend\nM(I).AP2.FD - Antipanik freidrehend\nMI.AP2.BL - Antipanik beidseitig lesend\nM(I).HZ - Halbzylinder\nA40.M(I) - Außenseite Scandinavian Oval/Round Zylinder\nI30 - Innenseite Scandinavian Oval/Round Zylinder","M(I).CO - Comfort\nMI.FD - freely rotating\nM(I).AP2.FD - Antipanic freely rotating\nMI.AP2.BL - Antipanik reading on both sides\nM(I).HZ - half cylinder\nA40.M(I) - outside version of Scandinavian Oval/Round Zylinder\nI30 - inside version of Scandinavian Oval/Round Zylinder","M(I).CO - Comfort\nMI.FD - Rotation libre des deux côtés\nM(I).AP2.FD - Anti-panique rotation libre des deux côtés\nMI.AP2.BL - Anti-panique (reading on both sides)\nM(I).HZ - Demi-cylindre\nA40.M(I) - outside version of Ovale scandinave/Rond cylindre\nI30 - inside version of Ovale scandinave/Rond cylindre","M(I).CO - Comfort\nMI.FD - Freidrehend\nM(I).AP2.FD - Antipanik freidrehend\nMI.AP2.BL - Antipanik beidseitig lesend\nM(I).HZ - Halbzylinder\nA40.M(I) - Außenseite Scandinavian Oval/Round Zylinder\nI30 - Innenseite Scandinavian Oval/Round Zylinder","M(I).CO - Comfort\nMI.FD - Freidrehend\nM(I).AP2.FD - Antipanik freidrehend\nMI.AP2.BL - Antipanik beidseitig lesend\nM(I).HZ - Halbzylinder\nA40.M(I) - Außenseite Scandinavian Oval/Round Zylinder\nI30 - Innenseite Scandinavian Oval/Round Zylinder","M(I).CO - Komfort\nMI.FD - frit roterende\nM(I).AP2.FD - Antipanik frit roterende\nMI.AP2.BL - Antipanik læser på begge sider\nM(I).HZ - halvcylinder\nA40.M(I) - udendørs version af Skandinavisk Oval/Rund cylinder\nI30 - indendørs version af Skandinavisk Oval/Rund cylinder"]
["Optionen",".DK = demontierbarer Knauf\n.MR = Multirast\n.MS = Messing\n.WP = Wetterfest",".DK = detachable knob\n.MR = Multi-point\n.MS = Brass\n.WP = Weatherproof",".DK = bouton démontable\n.MR = multi-enclenchements\n.MS = Laiton\n.WP = étanche",".DK = pomolo smontabile\n.MR = Multirast\n.MS = Ottone\n.WP = resistente alle intemperie",".DK = demonteerbare knop\n.MR = multirust-uitvoering\n.MS = Messing\n.WP = Weerbestendig",".DK = aftagelig knop\n.MR = Multi-point\n.MS = Messing\n.WP = Vejrbestandig (udendørs)"]
["Außenlänge","minimale Außenlänge 30 mm \n(.MR = 35 mm)","minimum outside length 30 mm\n(MR = 35 mm)","minimum outside length 30 mm\n(MR = 35 mm)","minimum outside length 30 mm\n(MR = 35 mm)","minimum outside length 30 mm\n(MR = 35 mm)","mindste udvendig længde 30 mm\n(.MR = 35 mm)"]
{"$rows_left_out":8}
{"sheet":"Bilder_SI_Zylinder","index":10,"n_rows":1,"n_cols":5,"rows_kept":1,"cut":false,"hidden":true,"merged":[]}
["Zylinder","Europrofil","Swiss_Round","Scandinavian_Oval","Scandinavian_Round"]

{"sheet":"Bilder SH-Cover für Anzeige","index":11,"n_rows":38,"n_cols":5,"rows_kept":38,"cut":false,"hidden":true,"merged":[]}
["schmal","Außenseite",null,null,"Innenseite"]
[null,"SI.SH.CS",null,null,"SI.SH.CS"]
[null,"SI.SH.CSP",null,null,"SI.SH.CS"]
[null,"SI.SH.CS.XX",null,null,"SI.SH.CS.XX"]
[null,"SI.SH.CSP.XX",null,null,"SI.SH.CS.XX"]
[null,"SI.SH.CS.SO",null,null,"SI.SH.CS.SO"]
{"$rows_left_out":33}
{"sheet":"Bilder SH-Cover sortiert","index":12,"n_rows":14,"n_cols":16,"rows_kept":14,"cut":false,"hidden":true,"merged":[[0,0,1,0],[0,1,0,5],[0,8,0,12],[1,1,1,2],[1,4,1,5],[1,8,1,9],[1,11,1,12]]}
[null,"schmal",null,null,null,null,null,null,"breit"]
[null,"für Außenseite",null,null,"für Innenseite",null,null,null,"für Außenseite",null,null,"für Innenseite"]
[null,"SI.SH.CSP",null,null,"SI.SH.CS",null,null,null,"SI.SH.CBP",null,null,"SI.SH.CB",null,null,null,{"$f":"SI_Programming_Gateways!$J$235","v":"noch zu übersetzen"}]
[null,"SI.SH.CSP.XX",null,null,"SI.SH.CS.XX",null,null,null,"SI.SH.CBP.XX",null,null,"SI.SH.CB.XX"]
[null,"SI.SH.CSP.SO",null,null,"SI.SH.CS.SO",null,null,null,"SI.SH.CBP.SO",null,null,"SI.SH.CB.SO"]
[null,"SI.SH.CSP.SO.105",null,null,"SI.SH.CS.SO.105",null,null,null,"SI.SH.CBP.SO.105",null,null,"SI.SH.CB.SO.105"]
{"$rows_left_out":9}
{"sheet":"Langtext_Cover_Übers.","index":13,"n_rows":40,"n_cols":9,"rows_kept":40,"cut":false,"hidden":true,"merged":[]}
["Artikelnummer",null,null,"Artikelnummer","Deutsch","English","Français","Italiano","Nederlands"]
["SI.SH.CB","breites Cover / \nEuro-PZ",null,"SI.SH.CB","breites Cover / \nEuro-PZ","wide cover / \nEuro profile","plaque large  / profil européen","Cover larga /\nProfilo europeo","breed schild /\nEuro profiel"]
["SI.SH.CB.SO","breites Cover / \nScandinavian Oval",null,"SI.SH.CB.SO","breites Cover / \nScandinavian Oval","wide cover / \nScandinavian Oval","plaque large  / profil scandinave ovale","Cover larga /\nOvale scandinavo","breed schild /\nScandinavian Oval"]
["SI.SH.CB.SO.105","breites Cover / \nScandinavian Oval /\nmit Mechanical Override",null,"SI.SH.CB.SO.105","breites Cover / \nScandinavian Oval /\nmit Mechanical Override","wide cover / \nScandinavian Oval / \nwith mechanical override","plaque large / ovale scandinave / avec verrouillage mécanique","Cover larga /\nOvale Scnadinavo /\ncon override meccanico","breed schild /\nScandinavian Oval /\nmet Mechanical Override"]
["SI.SH.CB.SR","breites Cover / \nSwiss Round",null,"SI.SH.CB.SR","breites Cover / \nSwiss Round","wide cover / \nSwiss Round","plaque large /suisse rond","Cover larga / \nTondo svizzero","breed schild /\nSwiss Round"]
["SI.SH.CB.SR.A78","breites Cover / \nSwiss Round (Außenseite) /\nmit Mechanical Override",null,"SI.SH.CB.SR.A78","breites Cover / \nSwiss Round (Außenseite) /\nmit Mechanical Override","wide cover / \nSwiss Round (outside) / \nwith mechanical override","plaque large / suisse rond / avec verrouillage ménanique (extérieur)","Cover larga /\nTondo svizzero /\ncon override mecanico ( lato esterno )","breed schild /\nSwiss Round (buitenzijde) /\nmet Mechanical Override"]
{"$rows_left_out":35}
{"sheet":"Bilder für Rückwärtssuche","index":14,"n_rows":40,"n_cols":1,"rows_kept":40,"cut":false,"hidden":true,"merged":[]}
["Artikelnummer"]
["SI.SH.CB"]
["SI.SH.CB.SO"]
["SI.SH.CB.SO.105"]
["SI.SH.CB.SR"]
["SI.SH.CB.SR.A78"]
{"$rows_left_out":35}
{"sheet":"Tabelle1","index":15,"n_rows":216,"n_cols":9,"rows_kept":216,"cut":false,"hidden":true,"merged":[]}
["SmartHandles","Zeile 18","Zeile 19","Zeile 20","Zeile 21","Zeile 22","Zeile 23","Zeile 24"]
["Profil",{"$f":"MID(SI_Programming_Gateways!$O18,1,6)","v":{"$error":"#N/A"}},{"$f":"MID(SI_Programming_Gateways!$O19,1,6)","v":{"$error":"#N/A"}},{"$f":"MID(SI_Programming_Gateways!$O20,1,6)","v":""},{"$f":"MID(SI_Programming_Gateways!$O30,1,6)","v":""},{"$f":"MID(SI_Programming_Gateways!$O31,1,6)","v":""},{"$f":"MID(SI_Programming_Gateways!$O32,1,6)","v":""},{"$f":"MID(SI_Programming_Gateways!$O33,1,6)","v":""}]
["Bef./Schildbreite",{"$f":"MID(SI_Programming_Gateways!$O18,10,1)","v":{"$error":"#N/A"}},{"$f":"MID(SI_Programming_Gateways!$O19,10,1)","v":{"$error":"#N/A"}},{"$f":"MID(SI_Programming_Gateways!$O20,10,1)","v":""},{"$f":"MID(SI_Programming_Gateways!$O30,10,1)","v":""},{"$f":"MID(SI_Programming_Gateways!$O31,10,1)","v":""},{"$f":"MID(SI_Programming_Gateways!$O32,10,1)","v":""},{"$f":"MID(SI_Programming_Gateways!$O33,10,1)","v":""}]
["Version",{"$f":"MID(SI_Programming_Gateways!$O18,13,1)","v":{"$error":"#N/A"}},{"$f":"MID(SI_Programming_Gateways!$O19,13,1)","v":{"$error":"#N/A"}},{"$f":"MID(SI_Programming_Gateways!$O20,13,1)","v":""},{"$f":"MID(SI_Programming_Gateways!$O30,13,1)","v":""},{"$f":"MID(SI_Programming_Gateways!$O31,13,1)","v":""},{"$f":"MID(SI_Programming_Gateways!$O32,13,1)","v":""},{"$f":"MID(SI_Programming_Gateways!$O33,13,1)","v":""}]
["online/VCN",{"$f":"MID(SI_Programming_Gateways!$O18,17,1)","v":{"$error":"#N/A"}},{"$f":"MID(SI_Programming_Gateways!$O19,17,1)","v":{"$error":"#N/A"}},{"$f":"MID(SI_Programming_Gateways!$O20,17,1)","v":""},{"$f":"MID(SI_Programming_Gateways!$O30,17,1)","v":""},{"$f":"MID(SI_Programming_Gateways!$O31,17,1)","v":""},{"$f":"MID(SI_Programming_Gateways!$O32,17,1)","v":""},{"$f":"MID(SI_Programming_Gateways!$O33,17,1)","v":""}]
[]
{"$rows_left_out":211}
{"sheet":"Hilfstabelle für Zus.fass.","index":16,"n_rows":55,"n_cols":15,"rows_kept":55,"cut":false,"hidden":true,"merged":[]}
["Hilftabelle für Zusammenfassung"]
[]
["Menge","Artikelnummer","Beschreibung",null,null,null,null,null,null,null,"Artikeltyp","Zeile",null,null,"prüfen ob keine Auswahl"]
[{"$f":"IF('Bestellhilfe - ordering guide'!A17<>\"\",'Bestellhilfe - ordering guide'!A17,\"\")","v":1},{"$f":"IF('Bestellhilfe - ordering guide'!O17<>\"\",'Bestellhilfe - ordering guide'!O17,\"\")","v":"SI-S2.E1.01.AA.1.M08.M.WO"},{"$f":"IF('Bestellhilfe - ordering guide'!AP17<>\"\",'Bestellhilfe - ordering guide'!AP17,\"\")","v":"SmartHandle AX (Smart Intego), (E0) - Skandinavisk Oval\n- uden låsecylinderåbning / stående montage, sølv / sort grå (1), (M) SmartCards / SmartTagsWireless Online"},null,null,null,null,null,null,{"$f":"IF(B4<>\"\",\"x\",\"\")","v":"x"},"SmartHandle",17,null,{"$f":"IF(AND(J4=\"x\",A4=\"\"),1,0)","v":0},{"$f":"IF(J4=\"x\",1,0)","v":1}]
[{"$f":"IF('Bestellhilfe - ordering guide'!A18<>\"\",'Bestellhilfe - ordering guide'!A18,\"\")","v":""},{"$f":"IF('Bestellhilfe - ordering guide'!O18<>\"\",'Bestellhilfe - ordering guide'!O18,\"\")","v":""},{"$f":"IF('Bestellhilfe - ordering guide'!AP18<>\"\",'Bestellhilfe - ordering guide'!AP18,\"\")","v":""},null,null,null,null,null,null,"","SmartHandle",18,null,{"$f":"IF(AND(J5=\"x\",A5=\"\"),1,0)","v":0},{"$f":"IF(J5=\"x\",1,0)","v":0}]
[{"$f":"IF('Bestellhilfe - ordering guide'!A19<>\"\",'Bestellhilfe - ordering guide'!A19,\"\")","v":""},{"$f":"IF('Bestellhilfe - ordering guide'!O19<>\"\",'Bestellhilfe - ordering guide'!O19,\"\")","v":""},{"$f":"IF('Bestellhilfe - ordering guide'!AP19<>\"\",'Bestellhilfe - ordering guide'!AP19,\"\")","v":""},null,null,null,null,null,null,"","SmartHandle",19,null,0,0]
{"$rows_left_out":50}
{"sheet":"ID medium","index":17,"n_rows":696,"n_cols":15,"rows_kept":696,"cut":false,"hidden":true,"merged":[]}
[{"$f":"H201","v":"noch zu übersetzen"},null,null,null,null,null,null,null,null,null,{"$f":"'Hauptseite - main page'!G3","v":"Dansk"}]
[null,null,null,null,null,null,null,null,null,null,{"$f":"'SmartHandle Cover - order tool'!AR89","v":"noch zu übersetzen"}]
[]
[]
[{"$f":"H202","v":"noch zu übersetzen"}]
[]
{"$rows_left_out":691}
{"sheet":"Tabelle2","index":18,"n_rows":0,"n_cols":0,"rows_kept":0,"cut":false,"hidden":true,"merged":[]}

{"sheet":"OF-No.","index":19,"n_rows":1413,"n_cols":9,"rows_kept":1413,"cut":false,"hidden":true,"merged":[]}
["SV Nr.","OF - Nr.","Kategorie",null,null,null,null,null,{"$f":"'Hauptseite - main page'!B24","v":"Smarthandle"}]
["SI.SHAL08B721AA1AWP","OF10000",{"$f":"$I$1","v":"Smarthandle"},null,null,null,null,null,{"$f":"'Hauptseite - main page'!E24","v":"noch zu übersetzen"}]
["SI.SHAL08B882AA1A","OF10001",{"$f":"$I$1","v":"Smarthandle"},null,null,null,null,null,{"$f":"'Hauptseite - main page'!K227","v":"noch zu übersetzen"}]
["SI.SHAL08B921DD1A","OF10002","Smarthandle",null,null,null,null,null,{"$f":"'Hauptseite - main page'!J24","v":"noch zu übersetzen"}]
["SI.SHAL08C001AA1A","OF10003","Smarthandle",null,null,null,null,null,{"$f":"'Hauptseite - main page'!K228","v":"noch zu übersetzen"}]
["SI.SHAL08C001BB1A","OF10004","Smarthandle"]
{"$rows_left_out":1408}
{"sheet":"Tabelle3","index":20,"n_rows":0,"n_cols":0,"rows_kept":0,"cut":false,"hidden":true,"merged":[]}